perl.daily-build.reports
[Top] [All Lists]

Smoke [5.11.2] v5.11.2-187-g3bc3c5b FAIL(X) mirbsd 10 (i386/1 cpu)

Subject: Smoke [5.11.2] v5.11.2-187-g3bc3c5b FAILX) mirbsd 10 (i386/1 cpu
From: Steven Schubiger
Date: Sun, 20 Dec 2009 00:02:27 -0800 PST
Newsgroups: perl.daily-build.reports

Automated smoke report for 5.11.2 patch 
3bc3c5beacd5fac2157b8441ce88ad169a9bc6b0 v5.11.2-187-g3bc3c5b
eurynome.mirbsd.org: Dual-Core AMD Opteron(tm) Processor 1212 HE 
("AuthenticAMD" 686-class, 1024KB L2 cache) (2000 MHz) (i386/1 cpu)
    on        mirbsd - 10
    using     mgcc version 3.4.6 (propolice; gpc; MirOS 0AA6)
    smoketime 20 hours 1 minute (average 2 hours 30 minutes)

Summary: FAIL(X)

O = OK  F = Failure(s), extended report at the bottom
X = Failure(s) under TEST but not under harness
? = still running or test results not (yet) available
Build failures during:       - = unknown or N/A
c = Configure, m = make, M = make (after miniperl), t = make test-prep

v5.11.2-187-g3bc3c5b  Configuration (common) none
----------- ---------------------------------------------------------
X X X X     
X X X X     -Duse64bitint
X X X X     -Duseithreads
X X X X     -Duseithreads -Duse64bitint
| | | +----- PERLIO = perlio -DDEBUGGING
| | +------- PERLIO = stdio  -DDEBUGGING
| +--------- PERLIO = perlio
+----------- PERLIO = stdio


Locally applied patches:
    SMOKE3bc3c5beacd5fac2157b8441ce88ad169a9bc6b0

Tests skipped on user request:
    t/op/taint.t
Failures: (common-args) none
[stdio/perlio] 
[stdio/perlio] -DDEBUGGING
[stdio/perlio] -Duse64bitint
[stdio/perlio] -DDEBUGGING -Duse64bitint
Inconsistent test results (between TEST and harness):
    ../t/dist/Net-Ping/t/450_service.t......FAILED at test 9
    ../ext/Time-Local/t/Local.t.............FAILED at test 150
    ../t/op/sprintf.t.......................FAILED at test 219
    ../t/uni/overload.t.....................FAILED at test 34
    ../t/porting/test_bootstrap.t...........FAILED--non-zero wait status: 512
    ../t/porting/manifest.t.................FAILED at test 8876
    ../ext/DynaLoader/t/DynaLoader.t........FAILED at test 20

[stdio] -Duseithreads
[stdio] -Duseithreads -Duse64bitint
Inconsistent test results (between TEST and harness):
    ../t/dist/Net-Ping/t/450_service.t......FAILED at test 9
    ../t/porting/test_bootstrap.t...........FAILED--non-zero wait status: 512
    ../t/porting/manifest.t.................FAILED at test 8876
    ../ext/DynaLoader/t/DynaLoader.t........FAILED at test 20
    ../t/io/errno.t.........................FAILED at test 10
    ../ext/Time-Local/t/Local.t.............FAILED at test 150
    ../t/op/sprintf.t.......................FAILED at test 219
    ../t/uni/overload.t.....................FAILED at test 34

[perlio] -Duseithreads
[stdio] -DDEBUGGING -Duseithreads
[perlio] -Duseithreads -Duse64bitint
[stdio/perlio] -DDEBUGGING -Duseithreads -Duse64bitint
Inconsistent test results (between TEST and harness):
    ../t/dist/Net-Ping/t/450_service.t......FAILED at test 9
    ../t/porting/test_bootstrap.t...........FAILED--non-zero wait status: 512
    ../t/porting/manifest.t.................FAILED at test 8876
    ../ext/DynaLoader/t/DynaLoader.t........FAILED at test 20
    ../t/io/errno.t.........................FAILED at test 9
    ../ext/Time-Local/t/Local.t.............FAILED at test 150
    ../t/op/sprintf.t.......................FAILED at test 219
    ../t/uni/overload.t.....................FAILED at test 34

[perlio] -DDEBUGGING -Duseithreads
Inconsistent test results (between TEST and harness):
    ../t/dist/Net-Ping/t/450_service.t......FAILED at test 9
    ../t/porting/test_bootstrap.t...........FAILED--non-zero wait status: 512
    ../t/porting/manifest.t.................FAILED at test 8876
    ../ext/DynaLoader/t/DynaLoader.t........FAILED at test 20
    ../t/io/errno.t.........................FAILED at test 12
    ../ext/Time-Local/t/Local.t.............FAILED at test 150
    ../t/op/sprintf.t.......................FAILED at test 219
    ../t/uni/overload.t.....................FAILED at test 34

Compiler messages(gcc):
/tmp//ccXU5556.o: In function `main':
/tmp//ccRaL636.o: In function `main':
/tmp//cca13668.o: In function `xxx':
/tmp//ccJHFs92.o: In function `main':
sv.o: In function `Perl_sv_2pv_flags':
libperl.a(sv.o): In function `Perl_sv_2pv_flags':
<command line>:9:1: warning: "TIME_HIRES_STAT" redefined
<command line>:8:1: warning: this is the location of the previous definition
APItest.xs: In function `XS_XS__APItest_pmflag':
APItest.xs:930: warning: `Perl_pmflag' is deprecated (declared at 
../../proto.h:2610)
util.o: In function `savestr':
str.o: In function `str_2ptr':
../libperl.a(sv.o): In function `Perl_sv_2pv_flags':
/tmp//ccd23341.o: In function `main':
/home/stsc/source/p5-current/UU/try.c:20: warning: strcpy() is almost always 
misused, consider using strlcpy()
/tmp//ccZG6731.o: In function `main':
/home/stsc/source/p5-current/UU/try.c:29: warning: strcpy() is almost always 
misused, consider using strlcpy()
/tmp//ccK26090.o: In function `xxx':
/home/stsc/source/p5-current/UU/try.c:29: warning: vsprintf() is often misused, 
consider using vsnprintf()
/tmp//ccT18355.o: In function `main':
/home/stsc/source/p5-current/UU/try.c:52: warning: sprintf() is often misused, 
consider using snprintf()
/home/stsc/source/p5-current/sv.c:2769: warning: sprintf() is often misused, 
consider using snprintf()
<command line>:11:1: warning: "TIME_HIRES_STAT" redefined
<command line>:10:1: warning: this is the location of the previous definition
/home/stsc/source/p5-current/x2p/util.c:147: warning: strcpy() is almost always 
misused, consider using strlcpy()
/home/stsc/source/p5-current/x2p/str.c:32: warning: sprintf() is often misused, 
consider using snprintf()
/tmp//ccj23728.o: In function `main':
/tmp//ccp11328.o: In function `main':
/tmp//ccE19970.o: In function `xxx':
/tmp//ccP19746.o: In function `main':
/tmp//ccM15689.o: In function `main':
/tmp//ccU17395.o: In function `main':
/tmp//ccGx5876.o: In function `xxx':
/tmp//cciVi422.o: In function `main':
/tmp//ccb20490.o: In function `main':
/tmp//ccz15041.o: In function `main':
/tmp//ccE19526.o: In function `xxx':
/tmp//ccJ13335.o: In function `main':
<command line>:10:1: warning: "TIME_HIRES_STAT" redefined
<command line>:9:1: warning: this is the location of the previous definition
/tmp//ccG19867.o: In function `main':
/tmp//cck13205.o: In function `main':
/tmp//ccg10628.o: In function `xxx':
/tmp//ccha1193.o: In function `main':
<command line>:12:1: warning: "TIME_HIRES_STAT" redefined
<command line>:11:1: warning: this is the location of the previous definition
/tmp//ccX15751.o: In function `main':
/tmp//ccD17077.o: In function `main':
/tmp//ccb32184.o: In function `xxx':
/tmp//ccz24859.o: In function `main':
/tmp//cca19737.o: In function `main':
/tmp//cck15007.o: In function `main':
/tmp//ccy10917.o: In function `xxx':
/tmp//ccA25906.o: In function `main':

-- 
Report by Test::Smoke v1.40 build 1242 running on perl 5.8.8
(Reporter v0.035 / Smoker v0.044)

<Prev in Thread] Current Thread [Next in Thread>
  • Smoke [5.11.2] v5.11.2-187-g3bc3c5b FAIL(X) mirbsd 10 (i386/1 cpu), Steven Schubiger <=