perl.daily-build.reports
[Top] [All Lists]

Smoke [5.11.2] v5.11.2-172-g53fc1c7 FAIL(X) netbsd 5.0.1 (i386/1 cpu)

Subject: Smoke [5.11.2] v5.11.2-172-g53fc1c7 FAILX) netbsd 5.0.1 (i386/1 cpu
From: Steven Schubiger
Date: Thu, 17 Dec 2009 21:32:56 -0800 PST
Newsgroups: perl.daily-build.reports

Automated smoke report for 5.11.2 patch 
53fc1c7e149a219087a8d9ad9879eb0a6ea109d9 v5.11.2-172-g53fc1c7
p5netbsd: Intel 686-class (i386/1 cpu)
    on        netbsd - 5.0.1
    using     cc version 4.1.3 20080704 prerelease (NetBSD nb2 20081120)
    smoketime 6 hours 41 minutes (average 50 minutes 15 seconds)

Summary: FAIL(X)

O = OK  F = Failure(s), extended report at the bottom
X = Failure(s) under TEST but not under harness
? = still running or test results not (yet) available
Build failures during:       - = unknown or N/A
c = Configure, m = make, M = make (after miniperl), t = make test-prep

v5.11.2-172-g53fc1c7  Configuration (common) none
----------- ---------------------------------------------------------
O O X O     
O O O O     -Duse64bitint
O O X O     -Duseithreads
O O O O     -Duseithreads -Duse64bitint
| | | +----- PERLIO = perlio -DDEBUGGING
| | +------- PERLIO = stdio  -DDEBUGGING
| +--------- PERLIO = perlio
+----------- PERLIO = stdio


Locally applied patches:
    SMOKE53fc1c7e149a219087a8d9ad9879eb0a6ea109d9

Failures: (common-args) none
[stdio] -DDEBUGGING
Inconsistent test results (between TEST and harness):
    ../lib/Benchmark.t......................FAILED at test 127

[stdio] -DDEBUGGING -Duseithreads
Inconsistent test results (between TEST and harness):
    ../lib/Benchmark.t......................FAILED at test 126

Compiler messages(gcc):
perlio.c: In function 'PerlIOStdio_set_ptrcnt':
perlio.c:3437: warning: pointer targets in assignment differ in signedness
/usr/include/sys/cdefs_elf.h:67:20: error: missing binary operator before token 
"("
<command line>:1:1: warning: "TIME_HIRES_STAT" redefined
<command line>:1:1: warning: this is the location of the previous definition
APItest.xs: In function 'XS_XS__APItest_pmflag':
APItest.xs:930: warning: 'Perl_pmflag' is deprecated (declared at 
../../proto.h:2610)

-- 
Report by Test::Smoke v1.40 build 1242 running on perl 5.10.0
(Reporter v0.035 / Smoker v0.044)

<Prev in Thread] Current Thread [Next in Thread>
  • Smoke [5.11.2] v5.11.2-172-g53fc1c7 FAIL(X) netbsd 5.0.1 (i386/1 cpu), Steven Schubiger <=