perl.daily-build.reports
[Top] [All Lists]

Smoke [5.11.3] v5.11.3-5-g27bca32 FAIL(F) linux 2.6.27.29-0.1-default [S

Subject: Smoke [5.11.3] v5.11.3-5-g27bca32 FAILF) linux 2.6.27.29-0.1-default [SuSE] (x86_64/4 cpu
From: H.Merijn Brand
Date: Wed, 23 Dec 2009 03:57 +0100
Newsgroups: perl.daily-build.reports

Automated smoke report for 5.11.3 patch 
27bca3226281a592aed848b7e68ea50f27381dac v5.11.3-5-g27bca32
pc09: Intel(R) Xeon(R) CPU E5320 @ 1.86GHz (GenuineIntel 1596MHz) (x86_64/4 cpu)
    on        linux - 2.6.27.29-0.1-default [SuSE]
    using     ccache g++ version 4.3.2 [gcc-4_3-branch revision 141291]
    smoketime 2 hours 48 minutes (average 21 minutes 5 seconds)

Summary: FAIL(F)

O = OK  F = Failure(s), extended report at the bottom
X = Failure(s) under TEST but not under harness
? = still running or test results not (yet) available
Build failures during:       - = unknown or N/A
c = Configure, m = make, M = make (after miniperl), t = make test-prep

v5.11.3-5-g27bca32  Configuration (common) -Dcc=g++
----------- ---------------------------------------------------------
O O F O O F -Duselongdouble
O O F O O F -Duse64bitall
O O F O O F -Duseithreads -Duselongdouble
O O F O O F -Duseithreads -Duse64bitall
| | | | | +- LC_ALL = en_US.utf8 -DDEBUGGING
| | | | +--- PERLIO = perlio -DDEBUGGING
| | | +----- PERLIO = stdio  -DDEBUGGING
| | +------- LC_ALL = en_US.utf8
| +--------- PERLIO = perlio
+----------- PERLIO = stdio 

Locally applied patches:
    SMOKE27bca3226281a592aed848b7e68ea50f27381dac
    SMOKE27bca3226281a592aed848b7e68ea50f27381dac

Testsuite was run only with 'harness'

Failures: (common-args) -Dcc=g++
[en_US.utf8] -Duselongdouble
[en_US.utf8] -DDEBUGGING -Duselongdouble
[en_US.utf8] -Duse64bitall
[en_US.utf8] -DDEBUGGING -Duse64bitall
[en_US.utf8] -Duseithreads -Duselongdouble
[en_US.utf8] -DDEBUGGING -Duseithreads -Duselongdouble
[en_US.utf8] -Duseithreads -Duse64bitall
[en_US.utf8] -DDEBUGGING -Duseithreads -Duse64bitall
../t/re/reg_fold.t..........................................FAILED
    4428, 4434
../t/op/stash.t.............................................FAILED
../t/porting/diag.t.........................................FAILED

MANIFEST did not declare 'merijn/Configure'
MANIFEST did not declare 'merijn/Glossary'
MANIFEST did not declare 'merijn/config.sh'
MANIFEST did not declare 'merijn/config_h.SH'

Compiler messages(gcc):
APItest.xs: In function 'XS_XS__APItest_pmflag':
APItest.xs:930: warning: 'Perl_pmflag' is deprecated (declared at 
../../proto.h:2608)
Pattern(gcc): /(^(?-s:.+?):(?: In function .+?:$|(?: undefined reference to 
.+?$)|\d+(?:\:\d+)?: (?:warning:|error:|invalid) .+?$))/

-- 
Report by Test::Smoke v1.41 build 1248 running on perl 5.10.1
(Reporter v0.035 / Smoker v0.044)


<Prev in Thread] Current Thread [Next in Thread>