perl.daily-build.reports
[Top] [All Lists]

Smoke [5.11.3] v5.11.3-8-g5ef4d93 FAIL(F) HP-UX B.11.23/64 (ia64/2 cpu)

Subject: Smoke [5.11.3] v5.11.3-8-g5ef4d93 FAILF) HP-UX B.11.23/64 (ia64/2 cpu
From: "H.Merijn Brand"
Date: Mon, 28 Dec 2009 06:20 +0100
Newsgroups: perl.daily-build.reports

Automated smoke report for 5.11.3 patch 
5ef4d93ec97e5239010a45df06473288e04f739a v5.11.3-8-g5ef4d93
x1: Intel(R) Itanium 2 processor/1600 MHz (ia64/2 cpu)
    on        HP-UX - B.11.23/64
    using     cc version B3910B
    smoketime 7 hours 35 minutes (average 56 minutes 59 seconds)

Summary: FAIL(F)

O = OK  F = Failure(s), extended report at the bottom
X = Failure(s) under TEST but not under harness
? = still running or test results not (yet) available
Build failures during:       - = unknown or N/A
c = Configure, m = make, M = make (after miniperl), t = make test-prep

v5.11.3-8-g5ef4d93  Configuration (common) none
----------- ---------------------------------------------------------
O O F O O F 
O O F O O F -Duse64bitall
O O F O O F -Duseithreads
O O F O O F -Duseithreads -Duse64bitall
| | | | | +- LC_ALL = univ.utf8 -DDEBUGGING
| | | | +--- PERLIO = perlio -DDEBUGGING
| | | +----- PERLIO = stdio  -DDEBUGGING
| | +------- LC_ALL = univ.utf8
| +--------- PERLIO = perlio
+----------- PERLIO = stdio 

Locally applied patches:
    SMOKE5ef4d93ec97e5239010a45df06473288e04f739a

Testsuite was run only with 'harness'

Tests skipped on user request:
    lib/Test/Simple/t/utf8.t
Failures: (common-args) none
[univ.utf8] 
[univ.utf8] -DDEBUGGING
[univ.utf8] -Duseithreads
[univ.utf8] -DDEBUGGING -Duseithreads
../t/re/reg_fold.t..........................................FAILED
    4428, 4434
../t/porting/diag.t.........................................FAILED
../dist/Net-Ping/t/450_service.t............................FAILED

[univ.utf8] -Duse64bitall
[univ.utf8] -DDEBUGGING -Duse64bitall
[univ.utf8] -Duseithreads -Duse64bitall
[univ.utf8] -DDEBUGGING -Duseithreads -Duse64bitall
../t/re/reg_fold.t..........................................FAILED
    4428, 4434
../t/op/stash.t.............................................FAILED
../t/porting/diag.t.........................................FAILED
../dist/Net-Ping/t/450_service.t............................FAILED

-- 
Report by Test::Smoke v1.41 build 1248 running on perl 5.10.1
(Reporter v0.035 / Smoker v0.044)


<Prev in Thread] Current Thread [Next in Thread>