perl.daily-build.reports
[Top] [All Lists]

Smoke [5.11.2] v5.11.2-194-g9c455b5 FAIL(XF) HP-UX B.11.23/64 (ia64/2 cp

Subject: Smoke [5.11.2] v5.11.2-194-g9c455b5 FAILXF) HP-UX B.11.23/64 (ia64/2 cpu
From: Smoketest Removethispart
Date: Sun, 20 Dec 2009 10:51 -0800
Newsgroups: perl.daily-build.reports

Automated smoke report for 5.11.2 patch 
9c455b5f163e0962c0e63797d9f7b55b3a8d5276 v5.11.2-194-g9c455b5
hairball: Intel(R) Itanium 2 processor/1400 MHz (ia64/2 cpu)
    on        HP-UX - B.11.23/64
    using     cc version B3910B
    smoketime 15 hours 50 minutes (average 59 minutes 25 seconds)

Summary: FAIL(XF)

O = OK  F = Failure(s), extended report at the bottom
X = Failure(s) under TEST but not under harness
? = still running or test results not (yet) available
Build failures during:       - = unknown or N/A
c = Configure, m = make, M = make (after miniperl), t = make test-prep

v5.11.2-194-g9c455b5  Configuration (common) none
----------- ---------------------------------------------------------
F F F F     
F F F F     -Duse64bitint
X X X X     -Duselongdouble
F F F F     -Dusemorebits
F F F F     -Duseithreads
F F F F     -Duseithreads -Duse64bitint
X X X X     -Duseithreads -Duselongdouble
F F F F     -Duseithreads -Dusemorebits
| | | +----- PERLIO = perlio -DDEBUGGING
| | +------- PERLIO = stdio  -DDEBUGGING
| +--------- PERLIO = perlio
+----------- PERLIO = stdio


Locally applied patches:
    SMOKE9c455b5f163e0962c0e63797d9f7b55b3a8d5276

Failures: (common-args) none
[stdio/perlio] 
[stdio/perlio] -DDEBUGGING
[stdio/perlio] -Duse64bitint
[stdio/perlio] -DDEBUGGING -Duse64bitint
[stdio/perlio] -Dusemorebits
[stdio/perlio] -DDEBUGGING -Dusemorebits
[stdio/perlio] -Duseithreads
[stdio/perlio] -DDEBUGGING -Duseithreads
[stdio/perlio] -Duseithreads -Duse64bitint
[stdio/perlio] -DDEBUGGING -Duseithreads -Duse64bitint
[stdio/perlio] -Duseithreads -Dusemorebits
[stdio/perlio] -DDEBUGGING -Duseithreads -Dusemorebits
    ../t/porting/podcheck.t.....................................FAILED
        380

[stdio/perlio] -Duselongdouble
[stdio/perlio] -DDEBUGGING -Duselongdouble
[stdio/perlio] -Duseithreads -Duselongdouble
[stdio/perlio] -DDEBUGGING -Duseithreads -Duselongdouble
Inconsistent test results (between TEST and harness):
    ../t/cpan/Math-BigInt-FastCalc/t/bigintfc.tFAILED at test 308
    ../t/porting/podcheck.t.................FAILED at test 380
    ../t/cpan/Math-BigInt/t/bigintpm.t......FAILED at test 1982
    ../t/cpan/Math-BigInt/t/bare_mbi.t......FAILED at test 1976
    ../t/cpan/Math-BigInt/t/upgrade.t.......FAILED at test 2107
    ../t/cpan/Math-BigInt/t/bigintc.t.......FAILED at test 329
    ../t/cpan/Math-BigInt/t/sub_mbi.t.......FAILED at test 1976

-- 
Report by Test::Smoke v1.37_04 build 1254 running on perl 5.8.8
(Reporter v0.034 / Smoker v0.044)


<Prev in Thread] Current Thread [Next in Thread>
  • Smoke [5.11.2] v5.11.2-194-g9c455b5 FAIL(XF) HP-UX B.11.23/64 (ia64/2 cpu), Smoketest Removethispart <=