perl.daily-build.reports
[Top] [All Lists]

Smoke [5.11.2] v5.11.2-154-g2653dd3 FAIL(F) openvms V8.3-1H1 (IA64/2 cpu

Subject: Smoke [5.11.2] v5.11.2-154-g2653dd3 FAILF) openvms V8.3-1H1 (IA64/2 cpu
From: Craig A. Berry
Date: Mon, 14 Dec 2009 12:39:13 -0600
Newsgroups: perl.daily-build.reports

Automated smoke report for 5.11.2 patch 
2653dd3c22bd18d7877da53d515dc31c46d8fbea v5.11.2-154-g2653dd3
ALMA: HP rx2600  (1.50GHz/6.0MB) (IA64/2 cpu)
    on        openvms - V8.3-1H1
    using     ? CC/DECC version 70390018
    smoketime 5 hours 14 minutes (average 2 hours 37 minutes)

Summary: FAIL(F)

O = OK  F = Failure(s), extended report at the bottom
X = Failure(s) under TEST but not under harness
? = still running or test results not (yet) available
Build failures during:       - = unknown or N/A
c = Configure, m = make, M = make (after miniperl), t = make test-prep

v5.11.2-154-g2653dd3  Configuration (common) none
----------- ---------------------------------------------------------
F -         
F -         -Duseithreads
| +--------- -DDEBUGGING
+----------- no debugging


Locally applied patches:
    SMOKE2653dd3c22bd18d7877da53d515dc31c46d8fbea

Failures: (common-args) none
[default] 
    t/io/errno.....................................................FAILED at 
test 2
    
t/io/inplace...................................................FAILED--unexpected
 output at test 4
    
t/re/reg_posixcc...............................................FAILED--unexpected
 output at test 1507
    t/op/ref.......................................................FAILED at 
test 117
    cpan/ExtUtils-CBuilder/t/02-link...............................FAILED at 
test 8
    cpan/Module-Build/t/basic......................................FAILED at 
test 6
    cpan/Module-Build/t/compat.....................................FAILED at 
test 142
    cpan/Module-Build/t/install_extra_target.......................FAILED at 
test 4
    cpan/Module-Build/t/properties/module_name.....................FAILED at 
test 2
    cpan/Module-Build/t/properties/share_dir.......................FAILED at 
test 14
    
cpan/Pod-Parser/t/pod/find.....................................FAILED--expected 
4 tests, saw 1
    dist/base/t/fields-5.6.0.......................................FAILED--no 
leader found
    dist/base/t/fields-5.8.0.......................................FAILED--no 
leader found
    dist/ExtUtils-Install/t/InstallWithMM..........................FAILED at 
test 3
    
t/porting/diag.................................................FAILED--unexpected
 output at test 0

[default] -Duseithreads
    t/io/errno.....................................................FAILED at 
test 2
    
t/io/inplace...................................................FAILED--unexpected
 output at test 4
    
t/re/reg_posixcc...............................................FAILED--unexpected
 output at test 1507
    t/op/ref.......................................................FAILED at 
test 117
    cpan/ExtUtils-CBuilder/t/02-link...............................FAILED at 
test 8
    cpan/Module-Build/t/basic......................................FAILED at 
test 6
    cpan/Module-Build/t/compat.....................................FAILED at 
test 142
    cpan/Module-Build/t/install_extra_target.......................FAILED at 
test 4
    cpan/Module-Build/t/properties/module_name.....................FAILED at 
test 2
    cpan/Module-Build/t/properties/share_dir.......................FAILED at 
test 14
    
cpan/Pod-Parser/t/pod/find.....................................FAILED--expected 
4 tests, saw 1
    
cpan/Time-HiRes/t/HiRes........................................FAILED--expected 
40 tests, saw 38
    dist/base/t/fields-5.6.0.......................................FAILED--no 
leader found
    dist/base/t/fields-5.8.0.......................................FAILED--no 
leader found
    dist/ExtUtils-Install/t/InstallWithMM..........................FAILED at 
test 3
    
t/porting/diag.................................................FAILED--unexpected
 output at test 0

-- 
Report by Test::Smoke v1.39 build 1235 running on perl 5.10.0
(Reporter v0.035 / Smoker v0.044)

<Prev in Thread] Current Thread [Next in Thread>
  • Smoke [5.11.2] v5.11.2-154-g2653dd3 FAIL(F) openvms V8.3-1H1 (IA64/2 cpu), Craig A. Berry <=