perl.daily-build.reports
[Top] [All Lists]

Smoke [5.11.2] v5.11.2-117-g8b19c1f FAIL(Xm) darwin 9.8.0 (macppcG5/1 cp

Subject: Smoke [5.11.2] v5.11.2-117-g8b19c1f FAILXm) darwin 9.8.0 (macppcG5/1 cpu
From:
Date: Mon, 7 Dec 2009 06:54 +0100
Newsgroups: perl.daily-build.reports

Automated smoke report for 5.11.2 patch 
8b19c1f8f171b4db09e0f4369f5fa72b488e66bd v5.11.2-117-g8b19c1f
Tullamore.lan: iMac G5 (1.6 GHz) (macppcG5/1 cpu)
    on        darwin - 9.8.0 (Mac OS X)
    using     cc version 4.0.1 (Apple Inc. build 5493)
    smoketime 7 hours 51 minutes (average 58 minutes 54 seconds)

Summary: FAIL(Xm)

O = OK  F = Failure(s), extended report at the bottom
X = Failure(s) under TEST but not under harness
? = still running or test results not (yet) available
Build failures during:       - = unknown or N/A
c = Configure, m = make, M = make (after miniperl), t = make test-prep

v5.11.2-117-g8b19c1f  Configuration (common) -D'optimize=-O1 -g'
----------- ---------------------------------------------------------
X X X X X X 
O O O O O O -Duse64bitall
m - - m - - -Duseithreads
m - - m - - -Duseithreads -Duse64bitall
| | | | | +- LC_ALL = en_GB.UTF-8 -DDEBUGGING
| | | | +--- PERLIO = perlio -DDEBUGGING
| | | +----- PERLIO = stdio  -DDEBUGGING
| | +------- LC_ALL = en_GB.UTF-8
| +--------- PERLIO = perlio
+----------- PERLIO = stdio 

Locally applied patches:
    SMOKE8b19c1f8f171b4db09e0f4369f5fa72b488e66bd

Failures: (common-args) -D'optimize=-O1 -g'
[stdio/perlio/en_GB.UTF-8] 
[stdio/perlio/en_GB.UTF-8] -DDEBUGGING
Inconsistent test results (between TEST and harness):
    ../t/cpan/autodie/t/recv.t..............FAILED at test 5

Compiler messages(gcc):
perlio.c: In function 'PerlIOStdio_set_ptrcnt':
perlio.c:3437: warning: pointer targets in assignment differ in signedness
APItest.xs: In function 'XS_XS__APItest_pmflag':
APItest.xs:930: warning: 'Perl_pmflag' is deprecated (declared at 
../../proto.h:2550)
sv.c:9171: error: syntax error before ')' token
sv.c: In function 'S_vcatpvfn_missing_argument':
sv.c:9172: error: 'my_perl' undeclared (first use in this function)
sv.c:9172: error: (Each undeclared identifier is reported only once
sv.c:9172: error: for each function it appears in.)

-- 
Report by Test::Smoke v1.39 build 1235 running on perl 5.8.8
(Reporter v0.035 / Smoker v0.044)


<Prev in Thread] Current Thread [Next in Thread>
  • Smoke [5.11.2] v5.11.2-117-g8b19c1f FAIL(Xm) darwin 9.8.0 (macppcG5/1 cpu), shouldbedomo <=