perl.daily-build.reports
[Top] [All Lists]

Smoke [5.11.2] v5.11.2-114-g077f834 FAIL(X) mirbsd 10 (i386/1 cpu)

Subject: Smoke [5.11.2] v5.11.2-114-g077f834 FAILX) mirbsd 10 (i386/1 cpu
From: Steven Schubiger
Date: Mon, 7 Dec 2009 13:49:12 GMT
Newsgroups: perl.daily-build.reports

Automated smoke report for 5.11.2 patch 
077f834239e40e0523e428946baaf95eaec43724 v5.11.2-114-g077f834
eurynome.mirbsd.org: Dual-Core AMD Opteron(tm) Processor 1212 HE 
("AuthenticAMD" 686-class, 1024KB L2 cache) (2008 MHz) (i386/1 cpu)
    on        mirbsd - 10
    using     mgcc version 3.4.6 (propolice; gpc; MirOS 0AA6)
    smoketime 19 hours 13 minutes (average 2 hours 24 minutes)

Summary: FAIL(X)

O = OK  F = Failure(s), extended report at the bottom
X = Failure(s) under TEST but not under harness
? = still running or test results not (yet) available
Build failures during:       - = unknown or N/A
c = Configure, m = make, M = make (after miniperl), t = make test-prep

v5.11.2-114-g077f834  Configuration (common) none
----------- ---------------------------------------------------------
X X X X     
X X X X     -Duse64bitint
X X X X     -Duseithreads
X X X X     -Duseithreads -Duse64bitint
| | | +----- PERLIO = perlio -DDEBUGGING
| | +------- PERLIO = stdio  -DDEBUGGING
| +--------- PERLIO = perlio
+----------- PERLIO = stdio


Locally applied patches:
    SMOKE077f834239e40e0523e428946baaf95eaec43724

Tests skipped on user request:
    t/op/taint.t
Failures: (common-args) none
[stdio/perlio] 
[stdio/perlio] -DDEBUGGING
[stdio/perlio] -Duse64bitint
[stdio/perlio] -DDEBUGGING -Duse64bitint
Inconsistent test results (between TEST and harness):
    ../t/dist/Net-Ping/t/450_service.t......FAILED at test 9
    ../ext/Time-Local/t/Local.t.............FAILED at test 150
    ../t/op/sprintf.t.......................FAILED at test 219
    ../t/uni/overload.t.....................FAILED at test 34
    ../t/porting/test_bootstrap.t...........FAILED--non-zero wait status: 512
    ../t/porting/manifest.t.................FAILED at test 8864
    ../ext/DynaLoader/t/DynaLoader.t........FAILED at test 20

[stdio/perlio] -Duseithreads
[stdio/perlio] -DDEBUGGING -Duseithreads
[stdio/perlio] -Duseithreads -Duse64bitint
[stdio/perlio] -DDEBUGGING -Duseithreads -Duse64bitint
Inconsistent test results (between TEST and harness):
    ../t/dist/Net-Ping/t/450_service.t......FAILED at test 9
    ../t/porting/test_bootstrap.t...........FAILED--non-zero wait status: 512
    ../t/porting/manifest.t.................FAILED at test 8864
    ../ext/DynaLoader/t/DynaLoader.t........FAILED at test 20
    ../t/io/errno.t.........................FAILED at test 9
    ../ext/Time-Local/t/Local.t.............FAILED at test 150
    ../t/op/sprintf.t.......................FAILED at test 219
    ../t/uni/overload.t.....................FAILED at test 34

Compiler messages(gcc):
/tmp//ccx27456.o: In function `main':
/tmp//cck11568.o: In function `main':
/tmp//ccat8099.o: In function `xxx':
/tmp//ccN13789.o: In function `main':
sv.o: In function `Perl_sv_2pv_flags':
libperl.a(sv.o): In function `Perl_sv_2pv_flags':
<command line>:9:1: warning: "TIME_HIRES_STAT" redefined
<command line>:8:1: warning: this is the location of the previous definition
APItest.xs: In function `XS_XS__APItest_pmflag':
APItest.xs:930: warning: `Perl_pmflag' is deprecated (declared at 
../../proto.h:2550)
util.o: In function `savestr':
str.o: In function `str_2ptr':
../libperl.a(sv.o): In function `Perl_sv_2pv_flags':
/tmp//ccd27909.o: In function `main':
/home/stsc/source/p5-current/UU/try.c:20: warning: strcpy() is almost always 
misused, consider using strlcpy()
/tmp//ccz29236.o: In function `main':
/home/stsc/source/p5-current/UU/try.c:29: warning: strcpy() is almost always 
misused, consider using strlcpy()
/tmp//ccY23288.o: In function `xxx':
/home/stsc/source/p5-current/UU/try.c:29: warning: vsprintf() is often misused, 
consider using vsnprintf()
/tmp//ccv23241.o: In function `main':
/home/stsc/source/p5-current/UU/try.c:52: warning: sprintf() is often misused, 
consider using snprintf()
/home/stsc/source/p5-current/sv.c:2769: warning: sprintf() is often misused, 
consider using snprintf()
<command line>:11:1: warning: "TIME_HIRES_STAT" redefined
<command line>:10:1: warning: this is the location of the previous definition
/home/stsc/source/p5-current/x2p/util.c:147: warning: strcpy() is almost always 
misused, consider using strlcpy()
/home/stsc/source/p5-current/x2p/str.c:32: warning: sprintf() is often misused, 
consider using snprintf()
/tmp//ccT32075.o: In function `main':
/tmp//ccL17611.o: In function `main':
/tmp//ccdWv394.o: In function `xxx':
/tmp//cckR8601.o: In function `main':
/tmp//ccl25762.o: In function `main':
/tmp//ccCX2996.o: In function `main':
/tmp//ccj30501.o: In function `xxx':
/tmp//ccw24589.o: In function `main':
/tmp//cck22691.o: In function `main':
/tmp//ccfZ3752.o: In function `main':
/tmp//ccH11395.o: In function `xxx':
/tmp//ccnQ1482.o: In function `main':
<command line>:10:1: warning: "TIME_HIRES_STAT" redefined
<command line>:9:1: warning: this is the location of the previous definition
/tmp//ccI28657.o: In function `main':
/tmp//cck31262.o: In function `main':
/tmp//ccxa2682.o: In function `xxx':
/tmp//ccZ26850.o: In function `main':
<command line>:12:1: warning: "TIME_HIRES_STAT" redefined
<command line>:11:1: warning: this is the location of the previous definition
/tmp//ccj31523.o: In function `main':
/tmp//ccc14696.o: In function `main':
/tmp//ccD28782.o: In function `xxx':
/tmp//ccW19199.o: In function `main':
/tmp//ccW13435.o: In function `main':
/tmp//ccL14864.o: In function `main':
/tmp//ccV11875.o: In function `xxx':
/tmp//ccK15164.o: In function `main':

-- 
Report by Test::Smoke v1.40 build 1242 running on perl 5.8.8
(Reporter v0.035 / Smoker v0.044)

<Prev in Thread] Current Thread [Next in Thread>