perl.daily-build.reports
[Top] [All Lists]

Smoke [5.11.1] v5.11.1-227-gedb47d5 FAIL(XFM) linux 2.6.31-14-generic [d

Subject: Smoke [5.11.1] v5.11.1-227-gedb47d5 FAILXFM) linux 2.6.31-14-generic [debian] (x86_64/8 cpu
From: George Greer
Date: Tue, 17 Nov 2009 13:22 -0500
Newsgroups: perl.daily-build.reports

Automated smoke report for 5.11.1 patch 
edb47d5e45750eb7ab61981e15a22f43672ff4f4 v5.11.1-227-gedb47d5
zwei: Intel(R) Core(TM) i7 CPU 920 @ 2.67GHz (GenuineIntel 2668MHz) (x86_64/8 
cpu)
    on        linux - 2.6.31-14-generic [debian]
    using     cc version 4.4.1
    smoketime 10 hours 27 minutes (average 39 minutes 13 seconds)

Summary: FAIL(XFM)

O = OK  F = Failure(s), extended report at the bottom
X = Failure(s) under TEST but not under harness
? = still running or test results not (yet) available
Build failures during:       - = unknown or N/A
c = Configure, m = make, M = make (after miniperl), t = make test-prep

v5.11.1-227-gedb47d5  Configuration (common) none
----------- ---------------------------------------------------------
O O O O O O 
M - - O O O -Duse64bitint
F F F F F F -Duselongdouble
F F F F F F -Dusemorebits
F F F O O O -Duseithreads
F F F O O O -Duseithreads -Duse64bitint
F F F F F F -Duseithreads -Duselongdouble
X F F F F F -Duseithreads -Dusemorebits
| | | | | +- LC_ALL = en_US.utf8 -DDEBUGGING
| | | | +--- PERLIO = perlio -DDEBUGGING
| | | +----- PERLIO = stdio  -DDEBUGGING
| | +------- LC_ALL = en_US.utf8
| +--------- PERLIO = perlio
+----------- PERLIO = stdio 

Locally applied patches:
    SMOKEedb47d5e45750eb7ab61981e15a22f43672ff4f4

Failures: (common-args) none
[minitest] -Duse64bitint
    t/run/switchx...................FAILED--no leader found
    t/io/argv.......................FAILED--no leader found
    t/io/fs.........................FAILED--no leader found
    t/io/perlio.....................FAILED--expected 40 tests, saw 39
    t/re/pat_advanced...............FAILED--no leader found
    t/re/regexp_unicode_prop........FAILED--no leader found
    t/op/chdir......................FAILED--no leader found
    t/op/fork.......................FAILED at test 10
    t/op/inccode-tie................FAILED--no leader found
    t/op/inccode....................FAILED--no leader found
    t/op/magic......................FAILED at test 27
    t/op/mkdir......................FAILED--no leader found
    t/op/readline...................FAILED--no leader found
    t/op/split......................FAILED--no leader found
    t/op/stat.......................FAILED--no leader found
    t/op/switch.....................FAILED--expected 128 tests, saw 134
    t/op/taint......................FAILED--no leader found
    t/uni/class.....................FAILED--no leader found
    t/uni/fold......................FAILED--no leader found
    t/uni/lex_utf8..................FAILED--no leader found
    t/uni/lower.....................FAILED--no leader found
    t/uni/title.....................FAILED--no leader found
    t/uni/upper.....................FAILED--no leader found

[stdio/perlio] -Duselongdouble
[stdio/perlio] -Dusemorebits
    ../t/op/pack.t..............................................FAILED
        3934, 3936, 3939, 3941, 3944, 3946, 3949
        3951, 3954, 3956, 3984, 3986, 3989, 3991
        3994, 3996, 3999, 4001, 4004, 4006, 4310
        4320, 13566, 13568, 13570, 13572, 13574
        13577, 13732, 13734, 13736, 13738, 13740
        13743, 13746, 13749, 13752, 13755, 13758
        13761, 13764, 13767, 13770, 13773, 13776
        13779, 14374, 14380, 14383, 14389

[en_US.utf8] -Duselongdouble
[en_US.utf8] -Dusemorebits
    ../t/op/pack.t..............................................FAILED
        3934, 3936, 3939, 3941, 3944, 3946, 3949
        3951, 3954, 3956, 3984, 3986, 3989, 3991
        3994, 3996, 3999, 4001, 4004, 4006, 4310
        4320, 13566, 13568, 13570, 13572, 13574
        13577, 13580, 13583, 13586, 13589, 13592
        13595, 13598, 13601, 13604, 13607, 13610
        13613, 13616, 13619, 13732, 13734, 13736
        13738, 13740, 13743, 13746, 13749, 14374
        14380, 14383, 14389

[stdio] -DDEBUGGING -Duselongdouble
    ../t/op/pack.t..............................................FAILED
        3934, 3936, 3939, 3944, 3949, 3954, 3984
        3989, 3994, 3999, 4004, 13568, 13572, 13580
        13583, 13589, 13595, 13601, 13607, 13734
        13738, 13746, 13752, 13758, 13764, 13770
        13776, 14374, 14380, 14383, 14389

[perlio] -DDEBUGGING -Duselongdouble
[en_US.utf8] -DDEBUGGING -Dusemorebits
    ../t/op/pack.t..............................................FAILED
        3934, 3936, 3939, 3944, 3949, 3954, 3984
        3989, 3994, 3999, 4004, 13568, 13572, 13580
        13583, 13589, 13595, 13601, 13607, 13613
        13619, 13734, 13738, 13746, 13752, 13758
        13764, 13770, 13776, 13782, 14374, 14380
        14383, 14389

[en_US.utf8] -DDEBUGGING -Duselongdouble
[perlio] -DDEBUGGING -Dusemorebits
    ../t/op/pack.t..............................................FAILED
        3934, 3936, 3939, 3944, 3949, 3954, 3984
        3989, 3994, 3999, 4004, 13568, 13572, 13580
        13583, 13589, 13595, 13601, 13607, 13613
        13616, 13734, 13738, 13746, 13752, 13758
        13764, 13770, 13776, 13782, 14374, 14380
        14383, 14389

[stdio] -DDEBUGGING -Dusemorebits
    ../t/op/pack.t..............................................FAILED
        3934, 3936, 3939, 3944, 3949, 3954, 3984
        3989, 3994, 3999, 4004, 13568, 13572, 13580
        13583, 13589, 13595, 13601, 13607, 13613
        13616, 13734, 13738, 13746, 13752, 13758
        13764, 13770, 13776, 13782, 14374, 14380
        14383, 14389
Inconsistent test results (between TEST and harness):
    ../lib/Benchmark.t......................FAILED at test 13

[stdio/perlio/en_US.utf8] -Duseithreads
[stdio/perlio/en_US.utf8] -Duseithreads -Duse64bitint
    ../ext/re/t/lexical_debug.t.................................FAILED
        7-10
    ../ext/re/t/regop.t.........................................FAILED
        1, 3-4, 8-12, 19
        Bad plan.  You planned 48 tests but ran 19.

[stdio/perlio/en_US.utf8] -Duseithreads -Duselongdouble
[perlio/en_US.utf8] -Duseithreads -Dusemorebits
    ../ext/re/t/lexical_debug.t.................................FAILED
        7-10
    ../ext/re/t/regop.t.........................................FAILED
        1, 3-4, 8-12, 19
        Bad plan.  You planned 48 tests but ran 19.
    ../t/op/pack.t..............................................FAILED
        3934, 3936, 3939, 3944, 3949, 3954, 3984
        3989, 3994, 3999, 4004, 4310, 4320, 13566
        13577, 13732, 13743, 14374, 14380, 14383
        14389

[stdio/en_US.utf8] -DDEBUGGING -Duseithreads -Duselongdouble
[stdio/en_US.utf8] -DDEBUGGING -Duseithreads -Dusemorebits
    ../t/op/pack.t..............................................FAILED
        3934, 3939, 3944, 3949, 3954, 3984, 3989
        3994, 3999, 4004, 13566, 13732, 14374, 14380
        14383, 14389

[perlio] -DDEBUGGING -Duseithreads -Duselongdouble
[perlio] -DDEBUGGING -Duseithreads -Dusemorebits
    ../t/op/pack.t..............................................FAILED
        3934, 3939, 3944, 3949, 3954, 3984, 3989
        3994, 3999, 4004, 14374, 14380, 14383, 14389

[stdio] -Duseithreads -Dusemorebits
Inconsistent test results (between TEST and harness):
    ../ext/re/t/regop.t.....................FAILED at test 1
    ../t/dist/threads-shared/t/waithires.t..FAILED--expected 57 tests, saw 32
    ../t/op/pack.t..........................FAILED at test 3934
    ../ext/re/t/lexical_debug.t.............FAILED at test 7

Compiler messages(gcc):
try.c: In function âmainâ:
try.c:36: warning: ignoring return value of âpipeâ, declared with attribute 
warn_unused_result
try.c:37: warning: ignoring return value of âpipeâ, declared with attribute 
warn_unused_result
try.c:53: warning: ignoring return value of âwriteâ, declared with attribute 
warn_unused_result
try.c:66: warning: ignoring return value of âwriteâ, declared with attribute 
warn_unused_result
try.c:72: warning: ignoring return value of âwriteâ, declared with attribute 
warn_unused_result
try.c:78: warning: ignoring return value of âreadâ, declared with attribute 
warn_unused_result
util.c: In function âS_write_no_memâ:
util.c:67: warning: ignoring return value of âwriteâ, declared with attribute 
warn_unused_result
sv.c: In function âPerl_sv_2pv_flagsâ:
sv.c:2773: warning: ignoring return value of âgcvtâ, declared with attribute 
warn_unused_result
sv.c:2966: warning: ignoring return value of âgcvtâ, declared with attribute 
warn_unused_result
sv.c: In function âPerl_sv_vcatpvfnâ:
sv.c:9312: warning: ignoring return value of âgcvtâ, declared with attribute 
warn_unused_result
sv.c:10115: warning: ignoring return value of âgcvtâ, declared with attribute 
warn_unused_result
doio.c: In function âPerl_nextargvâ:
doio.c:870: warning: ignoring return value of âfchownâ, declared with attribute 
warn_unused_result
doio.c: In function âS_exec_failedâ:
doio.c:1380: warning: ignoring return value of âwriteâ, declared with attribute 
warn_unused_result
perlio.c: In function âPerlIO_debugâ:
perlio.c:517: warning: ignoring return value of âwriteâ, declared with 
attribute warn_unused_result
perlio.c: In function âS_more_refcounted_fdsâ:
perlio.c:2301: warning: ignoring return value of âwriteâ, declared with 
attribute warn_unused_result
Dumper.xs: In function âDD_dumpâ:
Dumper.xs:813: warning: format â%ldâ expects type âlong intâ, but argument 2 
has type âU32â
Call.xs: In function âfilter_callâ:
Call.xs:63: warning: format â%dâ expects type âintâ, but argument 3 has type 
âSTRLENâ
Call.xs:63: warning: format â%dâ expects type âintâ, but argument 5 has type 
âSTRLENâ
Call.xs:100: warning: format â%dâ expects type âintâ, but argument 4 has type 
âSTRLENâ
Call.xs:156: warning: format â%dâ expects type âintâ, but argument 3 has type 
âSTRLENâ
Call.xs:175: warning: format â%dâ expects type âintâ, but argument 4 has type 
âSTRLENâ
sdbm.c: In function âmakroomâ:
sdbm.c:371: warning: ignoring return value of âwriteâ, declared with attribute 
warn_unused_result
APItest.xs: In function âXS_XS__APItest_pmflagâ:
APItest.xs:930: warning: âPerl_pmflagâ is deprecated (declared at 
../../proto.h:2546)
sv.c:2773: warning: ignoring return value of âqgcvtâ, declared with attribute 
warn_unused_result
sv.c:2966: warning: ignoring return value of âqgcvtâ, declared with attribute 
warn_unused_result
sv.c:10115: warning: ignoring return value of âqgcvtâ, declared with attribute 
warn_unused_result
perlio.c:508: warning: ignoring return value of âwriteâ, declared with 
attribute warn_unused_result
perl.c: In function âS_init_tls_and_interpâ:
perl.c:106: warning: ignoring return value of âwriteâ, declared with attribute 
warn_unused_result
threads.xs: In function âS_ithread_createâ:
threads.xs:699: warning: ignoring return value of âwriteâ, declared with 
attribute warn_unused_result

-- 
Report by Test::Smoke v1.39 build 1235 running on perl 5.10.0
(Reporter v0.035 / Smoker v0.044)


<Prev in Thread] Current Thread [Next in Thread>
  • Smoke [5.11.1] v5.11.1-227-gedb47d5 FAIL(XFM) linux 2.6.31-14-generic [debian] (x86_64/8 cpu), George Greer <=