perl.daily-build.reports
[Top] [All Lists]

Smoke [5.11.1] v5.11.1-221-gb65597c FAIL(F) AIX 5.2.0.0/ML04 (PPC/1 cpu)

Subject: Smoke [5.11.1] v5.11.1-221-gb65597c FAILF) AIX 5.2.0.0/ML04 (PPC/1 cpu
From: H.Merijn Brand
Date: Mon, 16 Nov 2009 20:10 +0100
Newsgroups: perl.daily-build.reports

Automated smoke report for 5.11.1 patch 
b65597cb4d6f7ba547ab80880fc66b31b6f08c15 v5.11.1-221-gb65597c
i4: PPC_POWER4 (PPC/1 cpu)
    on        AIX - 5.2.0.0/ML04
    using     xlc -q32 version 9.0.0.8
    smoketime 20 hours 49 minutes (average 1 hour 44 minutes)

Summary: FAIL(F)

O = OK  F = Failure(s), extended report at the bottom
X = Failure(s) under TEST but not under harness
? = still running or test results not (yet) available
Build failures during:       - = unknown or N/A
c = Configure, m = make, M = make (after miniperl), t = make test-prep

v5.11.1-221-gb65597c  Configuration (common) none
----------- ---------------------------------------------------------
O O O O O O 
O O O O O O -Duse64bitint
O O O O O O -Duse64bitall
F F F O O O -Duseithreads
F F F O O O -Duseithreads -Duse64bitint
F F F O O O -Duseithreads -Duse64bitall
| | | | | +- LC_ALL = EN_US.UTF-8 -DDEBUGGING
| | | | +--- PERLIO = perlio -DDEBUGGING
| | | +----- PERLIO = stdio  -DDEBUGGING
| | +------- LC_ALL = EN_US.UTF-8
| +--------- PERLIO = perlio
+----------- PERLIO = stdio 

Locally applied patches:
    SMOKEb65597cb4d6f7ba547ab80880fc66b31b6f08c15

Testsuite was run only with 'harness'

Failures: (common-args) none
[stdio/perlio/EN_US.UTF-8] -Duseithreads
[stdio/perlio/EN_US.UTF-8] -Duseithreads -Duse64bitint
../ext/re/t/lexical_debug.t.................................FAILED
    7-10
../ext/re/t/regop.t.........................................FAILED
    1, 3-28
    Bad plan.  You planned 49 tests but ran 28.

[stdio/perlio/EN_US.UTF-8] -Duseithreads -Duse64bitall
../ext/re/t/lexical_debug.t.................................FAILED
    7-10
../ext/re/t/regop.t.........................................FAILED
    1, 8-12, 19
    Bad plan.  You planned 48 tests but ran 19.

MANIFEST did not declare 'cpan/DB_File/DB_File.pm.bak'
MANIFEST did not declare 'cpan/DB_File/t/db-btree.t.bak'
MANIFEST did not declare 'cpan/DB_File/t/db-hash.t.bak'
MANIFEST did not declare 'cpan/DB_File/t/db-recno.t.bak'
MANIFEST did not declare 'cpan/ExtUtils-CBuilder/compilet.exp'
MANIFEST did not declare 'cpan/ExtUtils-CBuilder/compilet.exp_old'
MANIFEST did not declare 'cpan/ExtUtils-MakeMaker/t/compilet.exp'
MANIFEST did not declare 'cpan/ExtUtils-MakeMaker/t/compilet.exp_old'
MANIFEST did not declare 'cpan/ExtUtils-ParseXS/t/XSMore.exp'
MANIFEST did not declare 'cpan/ExtUtils-ParseXS/t/XSMore.exp_old'
MANIFEST did not declare 'cpan/ExtUtils-ParseXS/t/XSTest.exp'
MANIFEST did not declare 'cpan/ExtUtils-ParseXS/t/XSTest.exp_old'
MANIFEST did not declare 'cpan/ExtUtils-ParseXS/t/XSUsage.exp'
MANIFEST did not declare 'cpan/ExtUtils-ParseXS/t/XSUsage.exp_old'
MANIFEST did not declare 'cpan/ExtUtils-ParseXS/t/compilet.exp'
MANIFEST did not declare 'cpan/ExtUtils-ParseXS/t/compilet.exp_old'
MANIFEST did not declare 'patchlevel.bak'
MANIFEST did not declare 'rm.sh'
MANIFEST did not declare 'rmf.sh'

Compiler messages(aix):
"pp_sys.c", line 3063.22: 1506-280 (W) Function argument assignment between 
types "char*" and "const char*" is not allowed.

-- 
Report by Test::Smoke v1.41 build 1248 running on perl 5.8.8
(Reporter v0.035 / Smoker v0.044)


<Prev in Thread] Current Thread [Next in Thread>