perl.daily-build.reports
[Top] [All Lists]

Smoke [5.11.0] v5.11.0-135-g04e82a4 FAIL(X) HP-UX B.11.23/64 (ia64/2 cpu

Subject: Smoke [5.11.0] v5.11.0-135-g04e82a4 FAILX) HP-UX B.11.23/64 (ia64/2 cpu
From: "H.Merijn Brand"
Date: Mon, 12 Oct 2009 07:39 +0200
Newsgroups: perl.daily-build.reports

Automated smoke report for 5.11.0 patch 
04e82a462b85b3d6265b04aa07a405316616dc66 v5.11.0-135-g04e82a4
x1: Intel(R) Itanium 2 processor/1600 MHz (ia64/2 cpu)
    on        HP-UX - B.11.23/64
    using     cc version B3910B
    smoketime 8 hours 54 minutes (average 1 hour 6 minutes)

Summary: FAIL(X)

O = OK  F = Failure(s), extended report at the bottom
X = Failure(s) under TEST but not under harness
? = still running or test results not (yet) available
Build failures during:       - = unknown or N/A
c = Configure, m = make, M = make (after miniperl), t = make test-prep

v5.11.0-135-g04e82a4  Configuration (common) none
----------- ---------------------------------------------------------
X X X X X X 
X X X X X X -Duse64bitall
X X X X X X -Duseithreads
X X X X X X -Duseithreads -Duse64bitall
| | | | | +- LC_ALL = univ.utf8 -DDEBUGGING
| | | | +--- PERLIO = perlio -DDEBUGGING
| | | +----- PERLIO = stdio  -DDEBUGGING
| | +------- LC_ALL = univ.utf8
| +--------- PERLIO = perlio
+----------- PERLIO = stdio 

Locally applied patches:
    SMOKE04e82a462b85b3d6265b04aa07a405316616dc66

Tests skipped on user request:
    lib/Test/Simple/t/utf8.t
Failures: (common-args) none
[stdio/perlio] 
[stdio/perlio] -DDEBUGGING
[stdio/perlio] -Duse64bitall
[stdio/perlio] -DDEBUGGING -Duse64bitall
Inconsistent test results (between TEST and harness):
    ../t/cpan/Parse-CPAN-Meta/t/21_bom.t....FAILED at test 1
    ../t/re/pat_special_cc.t................FAILED at test 1

[univ.utf8] 
[univ.utf8] -DDEBUGGING
[univ.utf8] -Duse64bitall
[univ.utf8] -DDEBUGGING -Duse64bitall
Inconsistent test results (between TEST and harness):
    ../t/cpan/Parse-CPAN-Meta/t/21_bom.t....FAILED at test 1
    ../t/porting/podcheck.t.................FAILED--no leader found
    ../t/dist/ExtUtils-Install/t/Installapi2.tFAILED--expected 70 tests, saw 24
    ../t/dist/ExtUtils-Install/t/Install.t..FAILED--expected 52 tests, saw 24
    ../t/re/pat_special_cc.t................FAILED at test 1

[stdio/perlio] -Duseithreads
[stdio/perlio] -DDEBUGGING -Duseithreads
[stdio/perlio] -Duseithreads -Duse64bitall
[stdio/perlio] -DDEBUGGING -Duseithreads -Duse64bitall
Inconsistent test results (between TEST and harness):
    ../t/cpan/Parse-CPAN-Meta/t/21_bom.t....FAILED at test 1
    ../t/re/pat_special_cc_thr.t............FAILED at test 1
    ../t/re/pat_special_cc.t................FAILED at test 1

[univ.utf8] -Duseithreads
[univ.utf8] -DDEBUGGING -Duseithreads
[univ.utf8] -Duseithreads -Duse64bitall
[univ.utf8] -DDEBUGGING -Duseithreads -Duse64bitall
Inconsistent test results (between TEST and harness):
    ../t/cpan/Parse-CPAN-Meta/t/21_bom.t....FAILED at test 1
    ../t/porting/podcheck.t.................FAILED--no leader found
    ../t/dist/ExtUtils-Install/t/Installapi2.tFAILED--expected 70 tests, saw 24
    ../t/re/pat_special_cc_thr.t............FAILED at test 1
    ../t/dist/ExtUtils-Install/t/Install.t..FAILED--expected 52 tests, saw 24
    ../t/re/pat_special_cc.t................FAILED at test 1

MANIFEST did not declare '.package'
MANIFEST did not declare 'MANIFEST.new'
MANIFEST did not declare 'merijn/Configure'
MANIFEST did not declare 'merijn/Glossary'
MANIFEST did not declare 'merijn/config.sh'
MANIFEST did not declare 'merijn/config_h.SH'

-- 
Report by Test::Smoke v1.40 build 1242 running on perl 5.10.1
(Reporter v0.035 / Smoker v0.044)


<Prev in Thread] Current Thread [Next in Thread>