perl.daily-build.reports
[Top] [All Lists]

Smoke [5.11.0] blead-2298-g1f766de FAIL(X) netbsd 5.0.1 (i386/1 cpu)

Subject: Smoke [5.11.0] blead-2298-g1f766de FAILX) netbsd 5.0.1 (i386/1 cpu
From: Steven Schubiger
Date: Sun, 13 Sep 2009 20:43:04 -0700 PDT
Newsgroups: perl.daily-build.reports

Automated smoke report for 5.11.0 patch 
1f766de98da2443bf3297eda85509d96ec3690db blead-2298-g1f766de
p5netbsd: Intel 686-class (i386/1 cpu)
    on        netbsd - 5.0.1
    using     cc version 4.1.3 20080704 prerelease (NetBSD nb2 20081120)
    smoketime 6 hours 28 minutes (average 48 minutes 31 seconds)

Summary: FAIL(X)

O = OK  F = Failure(s), extended report at the bottom
X = Failure(s) under TEST but not under harness
? = still running or test results not (yet) available
Build failures during:       - = unknown or N/A
c = Configure, m = make, M = make (after miniperl), t = make test-prep

blead-2298-g1f766de  Configuration (common) none
----------- ---------------------------------------------------------
O O X O     
O O O X     -Duse64bitint
O X O O     -Duseithreads
O X O O     -Duseithreads -Duse64bitint
| | | +----- PERLIO = perlio -DDEBUGGING
| | +------- PERLIO = stdio  -DDEBUGGING
| +--------- PERLIO = perlio
+----------- PERLIO = stdio


Locally applied patches:
    SMOKE1f766de98da2443bf3297eda85509d96ec3690db

Failures: (common-args) none
[stdio] -DDEBUGGING
Inconsistent test results (between TEST and harness):
    ../lib/Benchmark.t......................FAILED at test 127

[perlio] -DDEBUGGING -Duse64bitint
Inconsistent test results (between TEST and harness):
    ../lib/Benchmark.t......................FAILED at test 126

[perlio] -Duseithreads
[perlio] -Duseithreads -Duse64bitint
Inconsistent test results (between TEST and harness):
    ../lib/Benchmark.t......................FAILED at test 13

Compiler messages(gcc):
perlio.c: In function 'PerlIOStdio_set_ptrcnt':
perlio.c:3445: warning: pointer targets in assignment differ in signedness
/usr/include/sys/cdefs_elf.h:67:20: error: missing binary operator before token 
"("
<command line>:1:1: warning: "TIME_HIRES_STAT" redefined
<command line>:1:1: warning: this is the location of the previous definition
regexec.c: In function 'Perl_regexec_flags':
regexec.c:1826: warning: format '%llx' expects type 'long long unsigned int', 
but argument 3 has type 'U32'
regexec.c:1833: warning: format '%lld' expects type 'long long int', but 
argument 3 has type 'I32'
regexec.c:1840: warning: format '%llx' expects type 'long long unsigned int', 
but argument 3 has type 'U32'

-- 
Report by Test::Smoke v1.40 build 1242 running on perl 5.10.0
(Reporter v0.035 / Smoker v0.044)

<Prev in Thread] Current Thread [Next in Thread>
  • Smoke [5.11.0] blead-2298-g1f766de FAIL(X) netbsd 5.0.1 (i386/1 cpu), Steven Schubiger <=