perl.daily-build.reports
[Top] [All Lists]

Smoke [5.11.0] blead-1582-g7de6a42 FAIL(F) linux 2.6.27.23-0.1-default [

Subject: Smoke [5.11.0] blead-1582-g7de6a42 FAILF) linux 2.6.27.23-0.1-default [SuSE] (x86_64/4 cpu
From: H.Merijn Brand
Date: Tue, 14 Jul 2009 00:22 +0200
Newsgroups: perl.daily-build.reports

Automated smoke report for 5.11.0 patch 
7de6a4226c6dd997db56431071190f72ed9cef6b blead-1582-g7de6a42
pc09: Intel(R) Xeon(R) CPU E5320 @ 1.86GHz (GenuineIntel 1596MHz) (x86_64/4 cpu)
    on        linux - 2.6.27.23-0.1-default [SuSE]
    using     ccache cc version 4.3.2 [gcc-4_3-branch revision 141291]
    smoketime 2 hours 2 minutes (average 15 minutes 19 seconds)

Summary: FAIL(F)

O = OK  F = Failure(s), extended report at the bottom
X = Failure(s) under TEST but not under harness
? = still running or test results not (yet) available
Build failures during:       - = unknown or N/A
c = Configure, m = make, M = make (after miniperl), t = make test-prep

blead-1582-g7de6a42  Configuration (common) none
----------- ---------------------------------------------------------
O O F O O O -Duselongdouble
O O O O O F -Duse64bitall
O O O O O O -Duseithreads -Duselongdouble
F O O O O O -Duseithreads -Duse64bitall
| | | | | +- LC_ALL = en_US.utf8 -DDEBUGGING
| | | | +--- PERLIO = perlio -DDEBUGGING
| | | +----- PERLIO = stdio  -DDEBUGGING
| | +------- LC_ALL = en_US.utf8
| +--------- PERLIO = perlio
+----------- PERLIO = stdio 

Locally applied patches:
    SMOKE7de6a4226c6dd997db56431071190f72ed9cef6b

Testsuite was run only with 'harness'

Failures: (common-args) none
[en_US.utf8] -Duselongdouble
../t/op/stash.t.............................................FAILED
../ext/IO/t/io_dir.t........................................FAILED
    4

[en_US.utf8] -DDEBUGGING -Duse64bitall
../t/op/stash.t.............................................FAILED
../ext/IO/t/io_dir.t........................................FAILED
    6

[stdio] -Duseithreads -Duse64bitall
../t/op/stash.t.............................................FAILED
../lib/Net/Ping/t/450_service.t.............................FAILED
    26

MANIFEST did not declare 'merijn/Configure'
MANIFEST did not declare 'merijn/Glossary'
MANIFEST did not declare 'merijn/config.sh'
MANIFEST did not declare 'merijn/config_h.SH'

-- 
Report by Test::Smoke v1.39 build 1235 running on perl 5.8.8
(Reporter v0.035 / Smoker v0.044)


<Prev in Thread] Current Thread [Next in Thread>