perl.daily-build.reports
[Top] [All Lists]

Smoke [5.11.0] blead-1455-g3bce050 FAIL(F) linux 2.6.27.21-0.1-default [

Subject: Smoke [5.11.0] blead-1455-g3bce050 FAILF) linux 2.6.27.21-0.1-default [SuSE] (x86_64/4 cpu
From: H.Merijn Brand
Date: Sat, 27 Jun 2009 02:51 +0200
Newsgroups: perl.daily-build.reports

Automated smoke report for 5.11.0 patch 
3bce0506564aac8d4ed477fca801708e58b220ff blead-1455-g3bce050
pc09: Intel(R) Xeon(R) CPU E5320 @ 1.86GHz (GenuineIntel 1866MHz) (x86_64/4 cpu)
    on        linux - 2.6.27.21-0.1-default [SuSE]
    using     ccache g++ version 4.3.2 [gcc-4_3-branch revision 141291]
    smoketime 2 hours 17 minutes (average 17 minutes 15 seconds)

Summary: FAIL(F)

O = OK  F = Failure(s), extended report at the bottom
X = Failure(s) under TEST but not under harness
? = still running or test results not (yet) available
Build failures during:       - = unknown or N/A
c = Configure, m = make, M = make (after miniperl), t = make test-prep

blead-1455-g3bce050  Configuration (common) -Dcc=g++
----------- ---------------------------------------------------------
O F F O F F -Duselongdouble
O O O O O O -Duse64bitall
O O O O F O -Duseithreads -Duselongdouble
O O O O O O -Duseithreads -Duse64bitall
| | | | | +- LC_ALL = en_US.utf8 -DDEBUGGING
| | | | +--- PERLIO = perlio -DDEBUGGING
| | | +----- PERLIO = stdio  -DDEBUGGING
| | +------- LC_ALL = en_US.utf8
| +--------- PERLIO = perlio
+----------- PERLIO = stdio 

Locally applied patches:
    SMOKE3bce0506564aac8d4ed477fca801708e58b220ff
    SMOKE3bce0506564aac8d4ed477fca801708e58b220ff

Testsuite was run only with 'harness'

Failures: (common-args) -Dcc=g++
[perlio] -Duselongdouble
[perlio] -DDEBUGGING -Duselongdouble
../t/op/stash.t.............................................FAILED
../ext/IO/t/io_dir.t........................................FAILED
    6

[en_US.utf8] -Duselongdouble
[en_US.utf8] -DDEBUGGING -Duselongdouble
../t/op/stash.t.............................................FAILED
../ext/IO/t/io_dir.t........................................FAILED
    4

[perlio] -DDEBUGGING -Duseithreads -Duselongdouble
../t/op/stash.t.............................................FAILED
../ext/threads-shared/t/waithires.t.........................FAILED
    Bad plan.  You planned 57 tests but ran 37.

MANIFEST did not declare 'merijn/Configure'
MANIFEST did not declare 'merijn/Glossary'
MANIFEST did not declare 'merijn/config.sh'
MANIFEST did not declare 'merijn/config_h.SH'

Compiler messages(gcc):
Pattern(gcc): /(^(?-s:.+?):(?: In function .+?:$|(?: undefined reference to 
.+?$)|\d+(?:\:\d+)?: (?:warning:|error:|invalid) .+?$))/

-- 
Report by Test::Smoke v1.39 build 1235 running on perl 5.8.8
(Reporter v0.035 / Smoker v0.044)


<Prev in Thread] Current Thread [Next in Thread>