perl.daily-build.reports
[Top] [All Lists]

Smoke [5.11.0] blead-1255-g5988ef3 FAIL(F) linux 2.6.27.21-0.1-default [

Subject: Smoke [5.11.0] blead-1255-g5988ef3 FAILF) linux 2.6.27.21-0.1-default [SuSE] (x86_64/4 cpu
From: H.Merijn Brand
Date: Wed, 3 Jun 2009 02:14 +0200
Newsgroups: perl.daily-build.reports

Automated smoke report for 5.11.0 patch 
5988ef3d5134d80ef12900e39820199702634ca7 blead-1255-g5988ef3
pc09: Intel(R) Xeon(R) CPU E5320 @ 1.86GHz (GenuineIntel 1596MHz) (x86_64/4 cpu)
    on        linux - 2.6.27.21-0.1-default [SuSE]
    using     ccache g++ version 4.3.2 [gcc-4_3-branch revision 141291]
    smoketime 1 hour 57 minutes (average 14 minutes 42 seconds)

Summary: FAIL(F)

O = OK  F = Failure(s), extended report at the bottom
X = Failure(s) under TEST but not under harness
? = still running or test results not (yet) available
Build failures during:       - = unknown or N/A
c = Configure, m = make, M = make (after miniperl), t = make test-prep

blead-1255-g5988ef3  Configuration (common) -Dcc=g++
----------- ---------------------------------------------------------
F F F O O F -Duselongdouble
O O F O O F -Duse64bitall
O O F O O F -Duseithreads -Duselongdouble
O O F O O F -Duseithreads -Duse64bitall
| | | | | +- LC_ALL = en_US.utf8 -DDEBUGGING
| | | | +--- PERLIO = perlio -DDEBUGGING
| | | +----- PERLIO = stdio  -DDEBUGGING
| | +------- LC_ALL = en_US.utf8
| +--------- PERLIO = perlio
+----------- PERLIO = stdio 

Locally applied patches:
    SMOKE5988ef3d5134d80ef12900e39820199702634ca7
    SMOKE5988ef3d5134d80ef12900e39820199702634ca7

Testsuite was run only with 'harness'

Failures: (common-args) -Dcc=g++
[stdio] -Duselongdouble
../ext/IO/t/io_dir.t........................................FAILED
    4

[perlio] -Duselongdouble
../ext/IO/t/io_dir.t........................................FAILED
    3

[en_US.utf8] -Duselongdouble
[en_US.utf8] -DDEBUGGING -Duselongdouble
[en_US.utf8] -Duse64bitall
[en_US.utf8] -DDEBUGGING -Duse64bitall
[en_US.utf8] -Duseithreads -Duselongdouble
[en_US.utf8] -DDEBUGGING -Duseithreads -Duselongdouble
[en_US.utf8] -Duseithreads -Duse64bitall
[en_US.utf8] -DDEBUGGING -Duseithreads -Duse64bitall
../t/op/eval.t..............................................FAILED
    99

Compiler messages(gcc):
Pattern(gcc): /(^(?-s:.+?):(?: In function .+?:$|(?: undefined reference to 
.+?$)|\d+(?:\:\d+)?: (?:warning:|error:|invalid) .+?$))/

-- 
Report by Test::Smoke v1.39 build 1235 running on perl 5.8.8
(Reporter v0.035 / Smoker v0.044)


<Prev in Thread] Current Thread [Next in Thread>