perl.daily-build.reports
[Top] [All Lists]

Smoke [5.11.0] blead-1393-g4784c5e FAIL(F) MSWin32 WinXP/.Net SP3 (x86/2

Subject: Smoke [5.11.0] blead-1393-g4784c5e FAILF) MSWin32 WinXP/.Net SP3 (x86/2 cpu
From: Steve Hay
Date: Fri, 19 Jun 2009 07:45 +0100
Newsgroups: perl.daily-build.reports

Automated smoke report for 5.11.0 patch 
4784c5e80ccedd3734ce162e02ed1c7e25e60c01 blead-1393-g4784c5e
maldoror.bath.planit.group: Intel(R) Core(TM)2 CPU 6700 @ 2.66GHz(~2660 MHz) 
(x86/2 cpu)
    on        MSWin32 - WinXP/.Net SP3
    using     cl version 14.00.50727.762
    smoketime 6 hours 21 minutes (average 19 minutes 6 seconds)

Summary: FAIL(F)

O = OK  F = Failure(s), extended report at the bottom
X = Failure(s) under TEST but not under harness
? = still running or test results not (yet) available
Build failures during:       - = unknown or N/A
c = Configure, m = make, M = make (after miniperl), t = make test-prep

blead-1393-g4784c5e  Configuration (common) -DCCTYPE=MSVC80 
-DINST_TOP=$(INST_DRV)\Smoke\doesntexist
----------- ---------------------------------------------------------
F F         
F F         -Dusemymalloc
F F         -Duselargefiles
F F         -Duselargefiles -Dusemymalloc
F F         -Duseithreads -Uuseimpsys
F F         -Duseithreads -Uuseimpsys -Dusemymalloc
F F         -Duseithreads -Uuseimpsys -Duselargefiles
F F         -Duseithreads -Uuseimpsys -Duselargefiles -Dusemymalloc
F F         -Duseithreads
F F         -Duseithreads -Duselargefiles
| +--------- -DDEBUGGING
+----------- no debugging


Locally applied patches:
    SMOKE4784c5e80ccedd3734ce162e02ed1c7e25e60c01

Failures: (common-args) -DCCTYPE=MSVC80 -DINST_TOP=$(INST_DRV)\Smoke\doesntexist
[default] 
[default] -DDEBUGGING
[default] -Dusemymalloc
[default] -DDEBUGGING -Dusemymalloc
[default] -Duselargefiles
[default] -DDEBUGGING -Duselargefiles
[default] -Duselargefiles -Dusemymalloc
[default] -DDEBUGGING -Duselargefiles -Dusemymalloc
[default] -Duseithreads -Uuseimpsys
[default] -DDEBUGGING -Duseithreads -Uuseimpsys
[default] -Duseithreads -Uuseimpsys -Dusemymalloc
[default] -DDEBUGGING -Duseithreads -Uuseimpsys -Dusemymalloc
[default] -Duseithreads -Uuseimpsys -Duselargefiles
[default] -DDEBUGGING -Duseithreads -Uuseimpsys -Duselargefiles
[default] -Duseithreads -Uuseimpsys -Duselargefiles -Dusemymalloc
[default] -DDEBUGGING -Duseithreads -Uuseimpsys -Duselargefiles -Dusemymalloc
[default] -Duseithreads
[default] -DDEBUGGING -Duseithreads
[default] -Duseithreads -Duselargefiles
[default] -DDEBUGGING -Duseithreads -Duselargefiles
../lib/ExtUtils/t/arch_check.t..............................FAILED
    3-4, 8-9
../lib/ExtUtils/t/min_perl_version.t........................FAILED
    4, 6, 9, 14
../lib/ExtUtils/t/miniperl.t................................FAILED
    No plan found in TAP output
../lib/ExtUtils/t/postamble.t...............................FAILED
    4
../lib/ExtUtils/t/prereq.t..................................FAILED
    4-7
../lib/ExtUtils/t/writemakefile_args.t......................FAILED
    4-5, 16, 18, 22, 26, 29, 32
../lib/ExtUtils/t/xs.t......................................FAILED
    4-5

Compiler messages(MSWin32):
Cwd.xs(77) : warning C4101: 'symlink' : unreferenced local variable
# LINK : fatal error LNK1181: cannot open input file 'oldnames.lib'
# LINK : fatal error LNK1104: cannot open file 'oldnames.lib'

-- 
Report by Test::Smoke v1.39 build 1235 running on perl 5.11.0
(Reporter v0.035 / Smoker v0.044)


<Prev in Thread] Current Thread [Next in Thread>
  • Smoke [5.11.0] blead-1393-g4784c5e FAIL(F) MSWin32 WinXP/.Net SP3 (x86/2 cpu), Steve Hay <=