perl.daily-build.reports
[Top] [All Lists]

Smoke [5.11.0] blead-1393-g4784c5e FAIL(F) linux 2.6.27.21-0.1-default [

Subject: Smoke [5.11.0] blead-1393-g4784c5e FAILF) linux 2.6.27.21-0.1-default [SuSE] (x86_64/4 cpu
From: H.Merijn Brand
Date: Fri, 19 Jun 2009 00:22 +0200
Newsgroups: perl.daily-build.reports

Automated smoke report for 5.11.0 patch 
4784c5e80ccedd3734ce162e02ed1c7e25e60c01 blead-1393-g4784c5e
pc09: Intel(R) Xeon(R) CPU E5320 @ 1.86GHz (GenuineIntel 1596MHz) (x86_64/4 cpu)
    on        linux - 2.6.27.21-0.1-default [SuSE]
    using     ccache cc version 4.3.2 [gcc-4_3-branch revision 141291]
    smoketime 2 hours 2 minutes (average 15 minutes 19 seconds)

Summary: FAIL(F)

O = OK  F = Failure(s), extended report at the bottom
X = Failure(s) under TEST but not under harness
? = still running or test results not (yet) available
Build failures during:       - = unknown or N/A
c = Configure, m = make, M = make (after miniperl), t = make test-prep

blead-1393-g4784c5e  Configuration (common) none
----------- ---------------------------------------------------------
O O O F O O -Duselongdouble
O O O O O O -Duse64bitall
O O O F O F -Duseithreads -Duselongdouble
F O O O F F -Duseithreads -Duse64bitall
| | | | | +- LC_ALL = en_US.utf8 -DDEBUGGING
| | | | +--- PERLIO = perlio -DDEBUGGING
| | | +----- PERLIO = stdio  -DDEBUGGING
| | +------- LC_ALL = en_US.utf8
| +--------- PERLIO = perlio
+----------- PERLIO = stdio 

Locally applied patches:
    SMOKE4784c5e80ccedd3734ce162e02ed1c7e25e60c01

Testsuite was run only with 'harness'

Failures: (common-args) none
[stdio] -DDEBUGGING -Duselongdouble
../ext/IO/t/io_dir.t........................................FAILED
    4, 6

[stdio] -DDEBUGGING -Duseithreads -Duselongdouble
../ext/IO/t/io_dir.t........................................FAILED
    4

[en_US.utf8] -DDEBUGGING -Duseithreads -Duselongdouble
[stdio] -Duseithreads -Duse64bitall
[perlio/en_US.utf8] -DDEBUGGING -Duseithreads -Duse64bitall
../ext/IO/t/io_dir.t........................................FAILED
    6

MANIFEST did not declare 'merijn/Configure'
MANIFEST did not declare 'merijn/Glossary'
MANIFEST did not declare 'merijn/config.sh'
MANIFEST did not declare 'merijn/config_h.SH'

-- 
Report by Test::Smoke v1.39 build 1235 running on perl 5.8.8
(Reporter v0.035 / Smoker v0.044)


<Prev in Thread] Current Thread [Next in Thread>