perl.daily-build.reports
[Top] [All Lists]

Smoke [5.11.0] blead-1264-g50255d5 FAIL(F) linux 2.6.25.18-0.2-default [

Subject: Smoke [5.11.0] blead-1264-g50255d5 FAILF) linux 2.6.25.18-0.2-default [SuSE] (x86_64/4 cpu
From: H.Merijn Brand
Date: Fri, 5 Jun 2009 05:08 +0200
Newsgroups: perl.daily-build.reports

Automated smoke report for 5.11.0 patch 
50255d58c0706bb8dc18d9013e1541619334546f blead-1264-g50255d5
tux: Intel(R) Core(TM)2 Quad CPU Q9450 @ 2.66GHz (GenuineIntel 1998MHz) 
(x86_64/4 cpu)
    on        linux - 2.6.25.18-0.2-default [SuSE]
    using     ccache g++ version 4.3.1 20080507 (prerelease) [gcc-4_3-branch 
revision 135036]
    smoketime 1 hour 34 minutes (average 11 minutes 46 seconds)

Summary: FAIL(F)

O = OK  F = Failure(s), extended report at the bottom
X = Failure(s) under TEST but not under harness
? = still running or test results not (yet) available
Build failures during:       - = unknown or N/A
c = Configure, m = make, M = make (after miniperl), t = make test-prep

blead-1264-g50255d5  Configuration (common) -Dcc=g++
----------- ---------------------------------------------------------
O O F O O F -Duselongdouble
O F F O O F -Duse64bitall
O O F O O F -Duseithreads -Duselongdouble
O O F O O F -Duseithreads -Duse64bitall
| | | | | +- LC_ALL = en_US.utf8 -DDEBUGGING
| | | | +--- PERLIO = perlio -DDEBUGGING
| | | +----- PERLIO = stdio  -DDEBUGGING
| | +------- LC_ALL = en_US.utf8
| +--------- PERLIO = perlio
+----------- PERLIO = stdio 

Locally applied patches:
    SMOKE50255d58c0706bb8dc18d9013e1541619334546f
    SMOKE50255d58c0706bb8dc18d9013e1541619334546f

Testsuite was run only with 'harness'

Failures: (common-args) -Dcc=g++
[en_US.utf8] -Duselongdouble
[en_US.utf8] -DDEBUGGING -Duselongdouble
[en_US.utf8] -DDEBUGGING -Duse64bitall
[en_US.utf8] -Duseithreads -Duselongdouble
[en_US.utf8] -DDEBUGGING -Duseithreads -Duselongdouble
[en_US.utf8] -DDEBUGGING -Duseithreads -Duse64bitall
../t/op/eval.t..............................................FAILED
    99

[perlio] -Duse64bitall
../ext/IO/t/io_dir.t........................................FAILED
    3

[en_US.utf8] -Duse64bitall
[en_US.utf8] -Duseithreads -Duse64bitall
../t/op/eval.t..............................................FAILED
    99
../ext/IO/t/io_dir.t........................................FAILED
    3

MANIFEST did not declare 'ext/DB_File/DB_File.pm.bak'
MANIFEST did not declare 'ext/DB_File/t/db-btree.t.bak'
MANIFEST did not declare 'ext/DB_File/t/db-hash.t.bak'
MANIFEST did not declare 'ext/DB_File/t/db-recno.t.bak'
MANIFEST did not declare 
'ext/Test-Harness/t/ext/Test-Harness/t/source_tests/harness'
MANIFEST did not declare 'patchlevel.bak'

Compiler messages(gcc):
Pattern(gcc): /(^(?-s:.+?):(?: In function .+?:$|(?: undefined reference to 
.+?$)|\d+(?:\:\d+)?: (?:warning:|error:|invalid) .+?$))/

-- 
Report by Test::Smoke v1.39 build 1235 running on perl 5.10.0
(Reporter v0.035 / Smoker v0.044)


<Prev in Thread] Current Thread [Next in Thread>