perl.daily-build.reports
[Top] [All Lists]

Smoke [5.10.0] maint-5.10-1196-ga8a43ff FAIL(F) linux 2.6.25.18-0.2-defa

Subject: Smoke [5.10.0] maint-5.10-1196-ga8a43ff FAILF) linux 2.6.25.18-0.2-default [SuSE] (x86_64/4 cpu
From: H.Merijn Brand
Date: Wed, 27 May 2009 02:14 +0200
Newsgroups: perl.daily-build.reports

Automated smoke report for 5.10.0 patch 
a8a43ff0f2638c954fe34867dadcb2d38093888d maint-5.10-1196-ga8a43ff
tux: Intel(R) Core(TM)2 Quad CPU Q9450 @ 2.66GHz (GenuineIntel 2667MHz) 
(x86_64/4 cpu)
    on        linux - 2.6.25.18-0.2-default [SuSE]
    using     ccache cc version 4.3.1 20080507 (prerelease) [gcc-4_3-branch 
revision 135036]
    smoketime 3 hours 54 minutes (average 29 minutes 17 seconds)

Summary: FAIL(F)

O = OK  F = Failure(s), extended report at the bottom
X = Failure(s) under TEST but not under harness
? = still running or test results not (yet) available
Build failures during:       - = unknown or N/A
c = Configure, m = make, M = make (after miniperl), t = make test-prep

maint-5.10-1196-ga8a43ff  Configuration (common) none
----------- ---------------------------------------------------------
F F F F F F -Duselongdouble
F F F F F F -Duse64bitall
F F F F F F -Duseithreads -Duselongdouble
F F F F F F -Duseithreads -Duse64bitall
| | | | | +- LC_ALL = en_US.utf8 -DDEBUGGING
| | | | +--- PERLIO = perlio -DDEBUGGING
| | | +----- PERLIO = stdio  -DDEBUGGING
| | +------- LC_ALL = en_US.utf8
| +--------- PERLIO = perlio
+----------- PERLIO = stdio 

Locally applied patches:
    SMOKEa8a43ff0f2638c954fe34867dadcb2d38093888d

Testsuite was run only with 'harness'

Failures: (common-args) none
[stdio/perlio/en_US.utf8] -Duselongdouble
[stdio/perlio/en_US.utf8] -DDEBUGGING -Duselongdouble
[stdio/perlio/en_US.utf8] -Duseithreads -Duselongdouble
[stdio/perlio/en_US.utf8] -DDEBUGGING -Duseithreads -Duselongdouble
[stdio/perlio/en_US.utf8] -Duseithreads -Duse64bitall
[stdio/perlio/en_US.utf8] -DDEBUGGING -Duseithreads -Duse64bitall
../lib/CPANPLUS/t/15_CPANPLUS-Shell.t.......................FAILED
../lib/Term/UI/t/02_ui.t....................................FAILED
    Bad plan.  You planned 19 tests but ran 1.

[stdio/perlio/en_US.utf8] -Duse64bitall
../lib/CGI/t/fast.t.........................................FAILED
    Bad plan.  You planned 7 tests but ran 1.
../lib/CPANPLUS/t/15_CPANPLUS-Shell.t.......................FAILED
../lib/Term/UI/t/02_ui.t....................................FAILED
    Bad plan.  You planned 19 tests but ran 1.

[stdio/perlio/en_US.utf8] -DDEBUGGING -Duse64bitall
../lib/CGI/t/fast.t.........................................FAILED
    7
../lib/CPANPLUS/t/15_CPANPLUS-Shell.t.......................FAILED
../lib/Term/UI/t/02_ui.t....................................FAILED
    Bad plan.  You planned 19 tests but ran 1.

-- 
Report by Test::Smoke v1.39 build 1235 running on perl 5.10.0
(Reporter v0.035 / Smoker v0.044)


<Prev in Thread] Current Thread [Next in Thread>