perl.daily-build.reports
[Top] [All Lists]

Smoke [5.11.0] blead-1013-g39a4862 FAIL(F) HP-UX B.10.20 (PA-RISC2.0/32/

Subject: Smoke [5.11.0] blead-1013-g39a4862 FAILF) HP-UX B.10.20 (PA-RISC2.0/32/1 cpu
From: H.Merijn Brand
Date: Tue, 28 Apr 2009 21:51 +0200
Newsgroups: perl.daily-build.reports

Automated smoke report for 5.11.0 patch 
39a48622bc305354a2fe04d676bbcf726e63ca25 blead-1013-g39a4862
d3: PA8000 (PA-RISC2.0/32/1 cpu)
    on        HP-UX - B.10.20
    using     cc version A.10.32.30
    smoketime 22 hours 30 minutes (average 5 hours 37 minutes)

Summary: FAIL(F)

O = OK  F = Failure(s), extended report at the bottom
X = Failure(s) under TEST but not under harness
? = still running or test results not (yet) available
Build failures during:       - = unknown or N/A
c = Configure, m = make, M = make (after miniperl), t = make test-prep

blead-1013-g39a4862  Configuration (common) none
----------- ---------------------------------------------------------
O O O O O O 
F F F F F F -Duseithreads
| | | | | +- LC_ALL = univ.utf8 -DDEBUGGING
| | | | +--- PERLIO = perlio -DDEBUGGING
| | | +----- PERLIO = stdio  -DDEBUGGING
| | +------- LC_ALL = univ.utf8
| +--------- PERLIO = perlio
+----------- PERLIO = stdio 

Locally applied patches:
    SMOKE39a48622bc305354a2fe04d676bbcf726e63ca25

Tests skipped on user request:
    lib/Test/Simple/t/utf8.t
    lib/Math/Trig.t
Failures: (common-args) none
[stdio] -Duseithreads
    ../lib/Time/Local.t.........................................FAILED
        109-114
    ../lib/Time/localtime.t.....................................FAILED
        Bad plan.  You planned 109 tests but ran 1.
    ../t/op/regexp_qr_embed_thr.t...............................FAILED
        319-326, 330-340, 344, 346-349, 352-355
        357-366, 368-426
        Bad plan.  You planned 1369 tests but ran 426.
    ../t/op/time.t..............................................FAILED
        33-36

[perlio] -Duseithreads
    ../lib/Time/Local.t.........................................FAILED
        109-114
    ../lib/Time/localtime.t.....................................FAILED
        Bad plan.  You planned 109 tests but ran 1.
    ../t/op/regexp_qr_embed_thr.t...............................FAILED
        319-326, 330-340, 344, 346-349, 352-355
        357-366, 368-421
        Bad plan.  You planned 1369 tests but ran 421.
    ../t/op/time.t..............................................FAILED
        33-36

[univ.utf8] -Duseithreads
    ../lib/Time/Local.t.........................................FAILED
        109-114
    ../lib/Time/localtime.t.....................................FAILED
        Bad plan.  You planned 109 tests but ran 1.
    ../t/op/regexp_qr_embed_thr.t...............................FAILED
        319-326, 330-340, 344, 346-349, 352-355
        357-366, 368-420
        Bad plan.  You planned 1369 tests but ran 420.
    ../t/op/time.t..............................................FAILED
        33-36

[stdio] -DDEBUGGING -Duseithreads
    ../lib/Time/Local.t.........................................FAILED
        109-114
    ../lib/Time/localtime.t.....................................FAILED
        Bad plan.  You planned 109 tests but ran 1.
    ../t/op/regexp_qr_embed_thr.t...............................FAILED
        316-326, 330-340, 344, 346-349, 352-355
        357-366, 368-388
        Bad plan.  You planned 1369 tests but ran 388.
    ../t/op/time.t..............................................FAILED
        33-36

[perlio] -DDEBUGGING -Duseithreads
    ../lib/Time/Local.t.........................................FAILED
        109-114
    ../lib/Time/localtime.t.....................................FAILED
        Bad plan.  You planned 109 tests but ran 1.
    ../t/op/regexp_qr_embed_thr.t...............................FAILED
        316-326, 330-340, 344, 346-349, 352-355
        357-366, 368-387
        Bad plan.  You planned 1369 tests but ran 387.
    ../t/op/time.t..............................................FAILED
        33-36

[univ.utf8] -DDEBUGGING -Duseithreads
    ../lib/Time/Local.t.........................................FAILED
        109-114
    ../lib/Time/localtime.t.....................................FAILED
        Bad plan.  You planned 109 tests but ran 1.
    ../t/op/regexp_qr_embed_thr.t...............................FAILED
        316-326, 330-340, 344, 346-349, 352-355
        357-366, 368-385
        Bad plan.  You planned 1369 tests but ran 385.
    ../t/op/time.t..............................................FAILED
        33-36

Compiler messages(hpux):
cc: "try.c", line 53: error 1529: Cannot select field of non-structure.
cc: "try.c", line 53: error 1549: Modifiable lvalue required for assignment 
operator.
cc: "try.c", line 56: warning 604: Pointers are not assignment-compatible.
cc: "try.c", line 56: warning 563: Argument #2 is not the correct type.
cc: "try.c", line 57: error 1529: Cannot select field of non-structure.
cc: "try.c", line 57: error 1566: Test expression in for must be scalar.
cc: "pp_sys.c", line 1983: warning 611: Qualifiers are not 
assignment-compatible.
cc: "pp_sys.c", line 1983: warning 563: Argument #2 is not the correct type.

-- 
Report by Test::Smoke v1.39 build 1235 running on perl 5.8.8
(Reporter v0.035 / Smoker v0.044)


<Prev in Thread] Current Thread [Next in Thread>