perl.daily-build.reports
[Top] [All Lists]

Smoke [5.10.0] maint-5.10-333-g9d20908 FAIL(Fm) linux 2.6.25.18-0.2-defa

Subject: Smoke [5.10.0] maint-5.10-333-g9d20908 FAILFm) linux 2.6.25.18-0.2-default [SuSE] (x86_64/4 cpu
From: H.Merijn Brand
Date: Thu, 26 Mar 2009 04:52 +0100
Newsgroups: perl.daily-build.reports

Automated smoke report for 5.10.0 patch 
9d20908063546f3b632075bec44205d1b6f709b0 maint-5.10-333-g9d20908
tux: Intel(R) Core(TM)2 Quad CPU Q9450 @ 2.66GHz (GenuineIntel 1998MHz) 
(x86_64/4 cpu)
    on        linux - 2.6.25.18-0.2-default [SuSE]
    using     ccache g++ version 4.3.1 20080507 (prerelease) [gcc-4_3-branch 
revision 135036]
    smoketime 3 hours 16 minutes (average 24 minutes 36 seconds)

Summary: FAIL(Fm)

O = OK  F = Failure(s), extended report at the bottom
X = Failure(s) under TEST but not under harness
? = still running or test results not (yet) available
Build failures during:       - = unknown or N/A
c = Configure, m = make, M = make (after miniperl), t = make test-prep

maint-5.10-333-g9d20908  Configuration (common) -Dcc=g++
----------- ---------------------------------------------------------
m - - F F F -Duselongdouble
F F F F F F -Duse64bitall
F F F F F F -Duseithreads -Duselongdouble
F F F F F F -Duseithreads -Duse64bitall
| | | | | +- LC_ALL = en_US.utf8 -DDEBUGGING
| | | | +--- PERLIO = perlio -DDEBUGGING
| | | +----- PERLIO = stdio  -DDEBUGGING
| | +------- LC_ALL = en_US.utf8
| +--------- PERLIO = perlio
+----------- PERLIO = stdio 

Locally applied patches:
    MAINT35117
    SMOKE9d20908063546f3b632075bec44205d1b6f709b0
    SMOKE9d20908063546f3b632075bec44205d1b6f709b0

Testsuite was run only with 'harness'

Failures: (common-args) -Dcc=g++
[stdio/perlio/en_US.utf8] -DDEBUGGING -Duselongdouble
[stdio/perlio/en_US.utf8] -Duseithreads -Duselongdouble
[stdio/perlio/en_US.utf8] -DDEBUGGING -Duseithreads -Duselongdouble
[stdio/perlio/en_US.utf8] -Duseithreads -Duse64bitall
[stdio/perlio/en_US.utf8] -DDEBUGGING -Duseithreads -Duse64bitall
../ext/PerlIO/t/ioleaks.t...................................FAILED
../lib/Attribute/Handlers/t/linerep.t.......................FAILED
../lib/CPANPLUS/t/15_CPANPLUS-Shell.t.......................FAILED
../lib/Term/UI/t/02_ui.t....................................FAILED
    Bad plan.  You planned 19 tests but ran 1.

[stdio/perlio/en_US.utf8] -Duse64bitall
../ext/PerlIO/t/ioleaks.t...................................FAILED
../lib/Archive/Extract/t/01_Archive-Extract.t...............FAILED
    No plan found in TAP output
../lib/Archive/Tar/t/02_methods.t...........................FAILED
    No plan found in TAP output
../lib/Attribute/Handlers/t/linerep.t.......................FAILED
../lib/CGI/t/fast.t.........................................FAILED
    Bad plan.  You planned 7 tests but ran 1.
../lib/CPANPLUS/t/15_CPANPLUS-Shell.t.......................FAILED
../lib/Term/UI/t/02_ui.t....................................FAILED
    Bad plan.  You planned 19 tests but ran 1.

[stdio/perlio/en_US.utf8] -DDEBUGGING -Duse64bitall
../ext/PerlIO/t/ioleaks.t...................................FAILED
../lib/Attribute/Handlers/t/linerep.t.......................FAILED
../lib/CGI/t/fast.t.........................................FAILED
    7
../lib/CPANPLUS/t/15_CPANPLUS-Shell.t.......................FAILED
../lib/Term/UI/t/02_ui.t....................................FAILED
    Bad plan.  You planned 19 tests but ran 1.

Compiler messages(gcc):
Pattern(gcc): /(^(?-s:.+?):(?: In function .+?:$|(?: undefined reference to 
.+?$)|\d+(?:\:\d+)?: (?:warning:|error:|invalid) .+?$))/

-- 
Report by Test::Smoke v1.39 build 1235 running on perl 5.10.0
(Reporter v0.035 / Smoker v0.044)


<Prev in Thread] Current Thread [Next in Thread>