perl.daily-build.reports
[Top] [All Lists]

Smoke [5.11.0] blead-725-g4ec613f FAIL(X) netbsd 5.0_RC2 (i386/2 cpu)

Subject: Smoke [5.11.0] blead-725-g4ec613f FAILX) netbsd 5.0_RC2 (i386/2 cpu
From: Ulrich Habel
Date: Mon, 02 Mar 2009 17:41:16 -0800 PST
Newsgroups: perl.daily-build.reports

Automated smoke report for 5.11.0 patch 
4ec613fc9ea24805f53c42982fd74a869cd3674a blead-725-g4ec613f
hobbes.br.de: Intel 686-class (i386/2 cpu)
    on        netbsd - 5.0_RC2
    using     cc version 4.1.3 20080704 prerelease (NetBSD nb2 20081120)
    smoketime 3 hours 37 minutes (average 27 minutes 10 seconds)

Summary: FAIL(X)

O = OK  F = Failure(s), extended report at the bottom
X = Failure(s) under TEST but not under harness
? = still running or test results not (yet) available
Build failures during:       - = unknown or N/A
c = Configure, m = make, M = make (after miniperl), t = make test-prep

blead-725-g4ec613f  Configuration (common) none
----------- ---------------------------------------------------------
O O O O     
O O X O     -Duse64bitint
X O O O     -Duseithreads
O O O O     -Duseithreads -Duse64bitint
| | | +----- PERLIO = perlio -DDEBUGGING
| | +------- PERLIO = stdio  -DDEBUGGING
| +--------- PERLIO = perlio
+----------- PERLIO = stdio


Locally applied patches:
    SMOKE4ec613fc9ea24805f53c42982fd74a869cd3674a

Failures: (common-args) none
[stdio] -DDEBUGGING -Duse64bitint
Inconsistent test results (between TEST and harness):
    ../lib/Benchmark.t......................FAILED at test 127

[stdio] -Duseithreads
Inconsistent test results (between TEST and harness):
    ../lib/Benchmark.t......................FAILED at test 126

Compiler messages(gcc):
perlio.c: In function 'PerlIOStdio_set_ptrcnt':
perlio.c:3455: warning: pointer targets in assignment differ in signedness
<command line>:1:1: warning: "TIME_HIRES_STAT" redefined
<command line>:1:1: warning: this is the location of the previous definition
/usr/include/sys/cdefs_elf.h:67:20: error: missing binary operator before token 
"("

-- 
Report by Test::Smoke v1.39 build 1235 running on perl 5.10.0
(Reporter v0.035 / Smoker v0.044)


<Prev in Thread] Current Thread [Next in Thread>
  • Smoke [5.11.0] blead-725-g4ec613f FAIL(X) netbsd 5.0_RC2 (i386/2 cpu), Ulrich Habel <=