perl.daily-build.reports
[Top] [All Lists]

Smoke [5.11.0] blead-788-gac56ae2 FAIL(F) linux 2.6.25.18-0.2-default [S

Subject: Smoke [5.11.0] blead-788-gac56ae2 FAILF) linux 2.6.25.18-0.2-default [SuSE] (x86_64/4 cpu
From: H.Merijn Brand
Date: Sun, 22 Mar 2009 03:32 +0100
Newsgroups: perl.daily-build.reports

Automated smoke report for 5.11.0 patch 
ac56ae2e858af2a770b8e1bbf5cc5d10917fbc46 blead-788-gac56ae2
tux: Intel(R) Core(TM)2 Quad CPU Q9450 @ 2.66GHz (GenuineIntel 1998MHz) 
(x86_64/4 cpu)
    on        linux - 2.6.25.18-0.2-default [SuSE]
    using     ccache cc version 4.3.1 20080507 (prerelease) [gcc-4_3-branch 
revision 135036]
    smoketime 1 hour 32 minutes (average 11 minutes 35 seconds)

Summary: FAIL(F)

O = OK  F = Failure(s), extended report at the bottom
X = Failure(s) under TEST but not under harness
? = still running or test results not (yet) available
Build failures during:       - = unknown or N/A
c = Configure, m = make, M = make (after miniperl), t = make test-prep

blead-788-gac56ae2  Configuration (common) none
----------- ---------------------------------------------------------
O O O O O O -Duselongdouble
O F O O O O -Duse64bitall
O O O O O O -Duseithreads -Duselongdouble
O F O F F F -Duseithreads -Duse64bitall
| | | | | +- LC_ALL = en_US.utf8 -DDEBUGGING
| | | | +--- PERLIO = perlio -DDEBUGGING
| | | +----- PERLIO = stdio  -DDEBUGGING
| | +------- LC_ALL = en_US.utf8
| +--------- PERLIO = perlio
+----------- PERLIO = stdio 

Locally applied patches:
    SMOKEac56ae2e858af2a770b8e1bbf5cc5d10917fbc46

Testsuite was run only with 'harness' and HARNESS_OPTIONS=j3

Failures: (common-args) none
[perlio] -Duse64bitall
../t/io/perlio_leaks.t......................................FAILED
../lib/ExtUtils/CBuilder/t/01-basic.t.......................FAILED
    3

[perlio] -Duseithreads -Duse64bitall
../t/io/perlio_leaks.t......................................FAILED
../ext/IO/t/io_dir.t........................................FAILED
    3

[stdio/perlio/en_US.utf8] -DDEBUGGING -Duseithreads -Duse64bitall
../t/io/perlio_leaks.t......................................FAILED
../ext/IO-Compress/t/cz-14gzopen.t..........................FAILED
    Bad plan.  You planned 255 tests but ran 82.

MANIFEST did not declare 'merijn/Configure'
MANIFEST did not declare 'merijn/Configure.711'
MANIFEST did not declare 'merijn/Glossary'
MANIFEST did not declare 'merijn/config.sh'
MANIFEST did not declare 'merijn/config_h.SH'

Compiler messages(gcc):
time64.c: In function 'localtime64_r':
time64.c:509: warning: comparison between signed and unsigned

-- 
Report by Test::Smoke v1.39 build 1235 running on perl 5.10.0
(Reporter v0.035 / Smoker v0.044)


<Prev in Thread] Current Thread [Next in Thread>
  • Smoke [5.11.0] blead-788-gac56ae2 FAIL(F) linux 2.6.25.18-0.2-default [SuSE] (x86_64/4 cpu), H.Merijn Brand <=