perl.daily-build.reports
[Top] [All Lists]

Smoke [5.11.0] blead-582-g43239f9 FAIL(F) AIX 5.2.0.0/ML04 (PPC/1 cpu)

Subject: Smoke [5.11.0] blead-582-g43239f9 FAILF) AIX 5.2.0.0/ML04 (PPC/1 cpu
From: H.Merijn Brand
Date: Wed, 11 Feb 2009 15:05 +0100
Newsgroups: perl.daily-build.reports

Automated smoke report for 5.11.0 patch 
43239f9092558d64042e15f37666b1cd1d54a7f7 blead-582-g43239f9
i4: PPC_POWER4 (PPC/1 cpu)
    on        AIX - 5.2.0.0/ML04
    using     xlc -q32 version 9.0.0.0
    smoketime 15 hours 44 minutes (average 1 hour 18 minutes)

Summary: FAIL(F)

O = OK  F = Failure(s), extended report at the bottom
X = Failure(s) under TEST but not under harness
? = still running or test results not (yet) available
Build failures during:       - = unknown or N/A
c = Configure, m = make, M = make (after miniperl), t = make test-prep

blead-582-g43239f9  Configuration (common) none
----------- ---------------------------------------------------------
O O O O O O 
O O O O O O -Duse64bitint
F F F F F F -Duse64bitall
O O O O O O -Duseithreads
O O O O O O -Duseithreads -Duse64bitint
F F F F F F -Duseithreads -Duse64bitall
| | | | | +- LC_ALL = EN_US.UTF-8 -DDEBUGGING
| | | | +--- PERLIO = perlio -DDEBUGGING
| | | +----- PERLIO = stdio  -DDEBUGGING
| | +------- LC_ALL = EN_US.UTF-8
| +--------- PERLIO = perlio
+----------- PERLIO = stdio 

Locally applied patches:
    SMOKE43239f9092558d64042e15f37666b1cd1d54a7f7

Failures: (common-args) none
[stdio/perlio/EN_US.UTF-8] -Duse64bitall
[stdio/perlio/EN_US.UTF-8] -DDEBUGGING -Duse64bitall
    ../ext/SDBM_File/t/sdbm.t...................................FAILED
        No plan found in TAP output
    ../lib/DBM_Filter/t/02core.t................................FAILED
        Bad plan.  You planned 189 tests but ran 4.
    ../lib/DBM_Filter/t/compress.t..............................FAILED
        Bad plan.  You planned 23 tests but ran 11.
    ../lib/DBM_Filter/t/encode.t................................FAILED
        Bad plan.  You planned 26 tests but ran 13.
    ../lib/DBM_Filter/t/int32.t.................................FAILED
        Bad plan.  You planned 22 tests but ran 10.
    ../lib/DBM_Filter/t/null.t..................................FAILED
        Bad plan.  You planned 26 tests but ran 10.
    ../lib/DBM_Filter/t/utf8.t..................................FAILED
        Bad plan.  You planned 20 tests but ran 12.
    ../lib/Memoize/t/tie_sdbm.t.................................FAILED
        No plan found in TAP output

[stdio] -Duseithreads -Duse64bitall
[EN_US.UTF-8] -DDEBUGGING -Duseithreads -Duse64bitall
    ../ext/SDBM_File/t/sdbm.t...................................FAILED
        6
        Bad plan.  You planned 80 tests but ran 7.
    ../lib/DBM_Filter/t/02core.t................................FAILED
        Bad plan.  You planned 189 tests but ran 4.
    ../lib/DBM_Filter/t/compress.t..............................FAILED
        Bad plan.  You planned 23 tests but ran 11.
    ../lib/DBM_Filter/t/encode.t................................FAILED
        14
        Bad plan.  You planned 26 tests but ran 24.
    ../lib/DBM_Filter/t/int32.t.................................FAILED
        Bad plan.  You planned 22 tests but ran 10.
    ../lib/DBM_Filter/t/null.t..................................FAILED
        Bad plan.  You planned 26 tests but ran 10.
    ../lib/DBM_Filter/t/utf8.t..................................FAILED
        13
        Bad plan.  You planned 20 tests but ran 18.
    ../lib/Memoize/t/tie_sdbm.t.................................FAILED
        2-4

[perlio/EN_US.UTF-8] -Duseithreads -Duse64bitall
[perlio] -DDEBUGGING -Duseithreads -Duse64bitall
    ../ext/SDBM_File/t/sdbm.t...................................FAILED
        6
        Bad plan.  You planned 80 tests but ran 7.
    ../lib/DBM_Filter/t/02core.t................................FAILED
        Bad plan.  You planned 189 tests but ran 4.
    ../lib/DBM_Filter/t/compress.t..............................FAILED
        Bad plan.  You planned 23 tests but ran 11.
    ../lib/DBM_Filter/t/encode.t................................FAILED
        14
        Bad plan.  You planned 26 tests but ran 24.
    ../lib/DBM_Filter/t/int32.t.................................FAILED
        Bad plan.  You planned 22 tests but ran 10.
    ../lib/DBM_Filter/t/null.t..................................FAILED
        Bad plan.  You planned 26 tests but ran 10.
    ../lib/DBM_Filter/t/utf8.t..................................FAILED
        13
        Bad plan.  You planned 20 tests but ran 18.
    ../lib/Memoize/t/tie_sdbm.t.................................FAILED
        Bad plan.  You planned 4 tests but ran 0.

[stdio] -DDEBUGGING -Duseithreads -Duse64bitall
    ../ext/SDBM_File/t/sdbm.t...................................FAILED
        6
        Bad plan.  You planned 80 tests but ran 7.
    ../lib/DBM_Filter/t/02core.t................................FAILED
        Bad plan.  You planned 189 tests but ran 4.
    ../lib/DBM_Filter/t/compress.t..............................FAILED
        Bad plan.  You planned 23 tests but ran 11.
    ../lib/DBM_Filter/t/encode.t................................FAILED
        14
        Bad plan.  You planned 26 tests but ran 24.
    ../lib/DBM_Filter/t/int32.t.................................FAILED
        Bad plan.  You planned 22 tests but ran 10.
    ../lib/DBM_Filter/t/null.t..................................FAILED
        Bad plan.  You planned 26 tests but ran 10.
    ../lib/DBM_Filter/t/utf8.t..................................FAILED
        13
        Bad plan.  You planned 20 tests but ran 18.
    ../lib/Memoize/t/tie_sdbm.t.................................FAILED
        No plan found in TAP output

MANIFEST did not declare 'git_version.h'
MANIFEST did not declare 'rm.sh'
MANIFEST did not declare 'rmf.sh'

Compiler messages(aix):
"pp_sys.c", line 3045.22: 1506-280 (W) Function argument assignment between 
types "char*" and "const char*" is not allowed.

-- 
Report by Test::Smoke v1.39 build 1235 running on perl 5.8.8
(Reporter v0.035 / Smoker v0.044)


<Prev in Thread] Current Thread [Next in Thread>
  • Smoke [5.11.0] blead-582-g43239f9 FAIL(F) AIX 5.2.0.0/ML04 (PPC/1 cpu), H.Merijn Brand <=