perl.daily-build.reports
[Top] [All Lists]

Smoke [5.11.0] blead-641-g104393a FAIL(F) linux 2.6.22.19-0.2-default [S

Subject: Smoke [5.11.0] blead-641-g104393a FAILF) linux 2.6.22.19-0.2-default [SuSE] (x86_64/4 cpu
From: H.Merijn Brand
Date: Wed, 18 Feb 2009 01:58 +0100
Newsgroups: perl.daily-build.reports

Automated smoke report for 5.11.0 patch 
104393a727efd8bd71ca6d7f9b0d20a5b92fde48 blead-641-g104393a
pc09: Intel(R) Xeon(R) CPU E5320 @ 1.86GHz (GenuineIntel 1596MHz) (x86_64/4 cpu)
    on        linux - 2.6.22.19-0.2-default [SuSE]
    using     ccache g++ version 4.2.1 (SUSE Linux)
    smoketime 1 hour 47 minutes (average 13 minutes 28 seconds)

Summary: FAIL(F)

O = OK  F = Failure(s), extended report at the bottom
X = Failure(s) under TEST but not under harness
? = still running or test results not (yet) available
Build failures during:       - = unknown or N/A
c = Configure, m = make, M = make (after miniperl), t = make test-prep

blead-641-g104393a  Configuration (common) -Dcc=g++
----------- ---------------------------------------------------------
F O O O O O -Duselongdouble
O O O O O O -Duse64bitall
F O O O O F -Duseithreads -Duselongdouble
O O O O O O -Duseithreads -Duse64bitall
| | | | | +- LC_ALL = en_US.utf8 -DDEBUGGING
| | | | +--- PERLIO = perlio -DDEBUGGING
| | | +----- PERLIO = stdio  -DDEBUGGING
| | +------- LC_ALL = en_US.utf8
| +--------- PERLIO = perlio
+----------- PERLIO = stdio 

Locally applied patches:
    SMOKE104393a727efd8bd71ca6d7f9b0d20a5b92fde48
    SMOKE104393a727efd8bd71ca6d7f9b0d20a5b92fde48

Testsuite was run only with 'harness' and HARNESS_OPTIONS=j3

Failures: (common-args) -Dcc=g++
[stdio] -Duselongdouble
../t/io/perlio_leaks.t......................................FAILED
../t/op/rand.t..............................................FAILED
    5
../ext/Attribute-Handlers/t/linerep.t.......................FAILED

[stdio] -Duseithreads -Duselongdouble
../t/io/perlio_leaks.t......................................FAILED
../ext/Attribute-Handlers/t/linerep.t.......................FAILED
../lib/Memoize/t/speed.t....................................FAILED
    2

[en_US.utf8] -DDEBUGGING -Duseithreads -Duselongdouble
../t/io/perlio_leaks.t......................................FAILED
../ext/Attribute-Handlers/t/linerep.t.......................FAILED
../ext/IO/t/io_dir.t........................................FAILED
    4

MANIFEST did not declare 'merijn/Configure'
MANIFEST did not declare 'merijn/Configure.707'
MANIFEST did not declare 'merijn/Glossary'
MANIFEST did not declare 'merijn/config.sh'
MANIFEST did not declare 'merijn/config_h.SH'

Compiler messages(gcc):
time64.c: In function 'localtime64_r':
time64.c:509: warning: comparison between signed and unsigned
Pattern(gcc): /(^(?-s:.+?):(?: In function .+?:$|(?: undefined reference to 
.+?$)|\d+(?:\:\d+)?: (?:warning:|error:|invalid) .+?$))/

-- 
Report by Test::Smoke v1.39 build 1235 running on perl 5.8.8
(Reporter v0.035 / Smoker v0.044)


<Prev in Thread] Current Thread [Next in Thread>
  • Smoke [5.11.0] blead-641-g104393a FAIL(F) linux 2.6.22.19-0.2-default [SuSE] (x86_64/4 cpu), H.Merijn Brand <=