perl.daily-build.reports
[Top] [All Lists]

Smoke [5.11.0] 2008-12-29.22:47:11 FAIL(F) HP-UX B.10.20 (PA-RISC2.0/32/

Subject: Smoke [5.11.0] 2008-12-29.22:47:11 FAILF) HP-UX B.10.20 (PA-RISC2.0/32/1 cpu
From: H.Merijn Brand
Date: Thu, 1 Jan 2009 19:21 +0100
Newsgroups: perl.daily-build.reports

Automated smoke report for 5.11.0 patch 
fbb5a95cd7a2da48d68eadc01859bea9278f0eab 2008-12-29.22:47:11
d3: PA8000 (PA-RISC2.0/32/1 cpu)
    on        HP-UX - B.10.20
    using     gcc version 3.4.6
    smoketime 22 hours 58 minutes (average 5 hours 44 minutes)

Summary: FAIL(F)

O = OK  F = Failure(s), extended report at the bottom
X = Failure(s) under TEST but not under harness
? = still running or test results not (yet) available
Build failures during:       - = unknown or N/A
c = Configure, m = make, M = make (after miniperl), t = make test-prep

2008-12-29.22:47:11  Configuration (common) -Dcc=gcc
----------- ---------------------------------------------------------
O O O O O O 
F F F F F F -Duseithreads
| | | | | +- LC_ALL = univ.utf8 -DDEBUGGING
| | | | +--- PERLIO = perlio -DDEBUGGING
| | | +----- PERLIO = stdio  -DDEBUGGING
| | +------- LC_ALL = univ.utf8
| +--------- PERLIO = perlio
+----------- PERLIO = stdio 

Locally applied patches:
    DEVEL
    SMOKEfbb5a95cd7a2da48d68eadc01859bea9278f0eab
    SMOKEfbb5a95cd7a2da48d68eadc01859bea9278f0eab

Tests skipped on user request:
    lib/Test/Simple/t/utf8.t
    lib/Math/Trig.t
Failures: (common-args) -Dcc=gcc
[stdio] -Duseithreads
[stdio] -DDEBUGGING -Duseithreads
    ../t/op/regexp_qr_embed_thr.t...............................FAILED
        317-326, 330-340, 344, 346-349, 352-354
        Bad plan.  You planned 1367 tests but ran 354.

[perlio] -Duseithreads
[perlio] -DDEBUGGING -Duseithreads
    ../t/op/regexp_qr_embed_thr.t...............................FAILED
        317-326, 330-340, 344, 346-348
        Bad plan.  You planned 1367 tests but ran 348.

[univ.utf8] -Duseithreads
[univ.utf8] -DDEBUGGING -Duseithreads
    ../t/op/regexp_qr_embed_thr.t...............................FAILED
        317-326, 330-340, 344, 346-347
        Bad plan.  You planned 1367 tests but ran 347.

MANIFEST did not declare '.patchnum'
MANIFEST did not declare '.sha1'
MANIFEST did not declare 'a.out'
MANIFEST did not declare 
'ext/Test/Harness/t/ext/Test/Harness/t/source_tests/harness'
MANIFEST did not declare 'patchlevel.bak'

Compiler messages(gcc):
try.c: In function `main':
try.c:53: error: request for member `fds_bits' in something not a structure or 
union
try.c:56: warning: passing arg 2 of `select' from incompatible pointer type
try.c:57: error: request for member `fds_bits' in something not a structure or 
union
miniperlmain.c: In function `main':
miniperlmain.c:102: warning: implicit declaration of function `pthread_atfork'
perl.c: In function `perl_fini':
perl.c:1438: warning: implicit declaration of function `pthread_key_delete'
pp_sys.c: In function `Perl_pp_send':
pp_sys.c:1996: warning: passing arg 2 of `cma_send' discards qualifiers from 
pointer target type
pp_sys.c: In function `Perl_pp_gmtime':
pp_sys.c:4493: warning: implicit declaration of function `localtime_r'
pp_sys.c:4496: warning: implicit declaration of function `gmtime_r'
perlmain.c: In function `main':
perlmain.c:102: warning: implicit declaration of function `pthread_atfork'

-- 
Report by Test::Smoke v1.37 build 1217 running on perl 5.8.8
(Reporter v0.034 / Smoker v0.041)


<Prev in Thread] Current Thread [Next in Thread>
  • Smoke [5.11.0] 2008-12-29.22:47:11 FAIL(F) HP-UX B.10.20 (PA-RISC2.0/32/1 cpu), H.Merijn Brand <=