perl.daily-build.reports
[Top] [All Lists]

Smoke [5.11.0] 35067 FAIL(F) AIX 5.2.0.0/ML04 (PPC/1 cpu)

Subject: Smoke [5.11.0] 35067 FAILF) AIX 5.2.0.0/ML04 (PPC/1 cpu
From: H.Merijn Brand
Date: Wed, 10 Dec 2008 14:46 +0100
Newsgroups: perl.daily-build.reports

Automated smoke report for 5.11.0 patch 35067
i4: PPC_POWER4 (PPC/1 cpu)
    on        AIX - 5.2.0.0/ML04
    using     xlc -q32 version 9.0.0.0
    smoketime 15 hours 25 minutes (average 1 hour 17 minutes)

Summary: FAIL(F)

O = OK  F = Failure(s), extended report at the bottom
X = Failure(s) under TEST but not under harness
? = still running or test results not (yet) available
Build failures during:       - = unknown or N/A
c = Configure, m = make, M = make (after miniperl), t = make test-prep

   35067     Configuration (common) none
----------- ---------------------------------------------------------
O O O O O O 
O O O O O O -Duse64bitint
F F F F F F -Duse64bitall
O O O O O O -Duseithreads
O O O O O O -Duseithreads -Duse64bitint
F F F F F F -Duseithreads -Duse64bitall
| | | | | +- LC_ALL = EN_US.UTF-8 -DDEBUGGING
| | | | +--- PERLIO = perlio -DDEBUGGING
| | | +----- PERLIO = stdio  -DDEBUGGING
| | +------- LC_ALL = EN_US.UTF-8
| +--------- PERLIO = perlio
+----------- PERLIO = stdio 

Locally applied patches:
    DEVEL
    SMOKE35067

Failures: (common-args) none
[stdio/perlio/EN_US.UTF-8] -Duse64bitall
[stdio/perlio/EN_US.UTF-8] -DDEBUGGING -Duse64bitall
    ../ext/SDBM_File/t/sdbm.t...................................FAILED
        No plan found in TAP output
    ../lib/DBM_Filter/t/02core.t................................FAILED
        Bad plan.  You planned 189 tests but ran 4.
    ../lib/DBM_Filter/t/compress.t..............................FAILED
        Bad plan.  You planned 23 tests but ran 11.
    ../lib/DBM_Filter/t/encode.t................................FAILED
        Bad plan.  You planned 26 tests but ran 13.
    ../lib/DBM_Filter/t/int32.t.................................FAILED
        Bad plan.  You planned 22 tests but ran 10.
    ../lib/DBM_Filter/t/null.t..................................FAILED
        Bad plan.  You planned 26 tests but ran 10.
    ../lib/DBM_Filter/t/utf8.t..................................FAILED
        Bad plan.  You planned 20 tests but ran 12.
    ../lib/Memoize/t/tie_sdbm.t.................................FAILED
        No plan found in TAP output

[stdio] -Duseithreads -Duse64bitall
    ../ext/SDBM_File/t/sdbm.t...................................FAILED
        6
        Bad plan.  You planned 80 tests but ran 7.
    ../lib/DBM_Filter/t/02core.t................................FAILED
        Bad plan.  You planned 189 tests but ran 4.
    ../lib/DBM_Filter/t/compress.t..............................FAILED
        Bad plan.  You planned 23 tests but ran 11.
    ../lib/DBM_Filter/t/encode.t................................FAILED
        14
        Bad plan.  You planned 26 tests but ran 24.
    ../lib/DBM_Filter/t/int32.t.................................FAILED
        Bad plan.  You planned 22 tests but ran 10.
    ../lib/DBM_Filter/t/null.t..................................FAILED
        Bad plan.  You planned 26 tests but ran 10.
    ../lib/DBM_Filter/t/utf8.t..................................FAILED
        13
        Bad plan.  You planned 20 tests but ran 18.
    ../lib/Memoize/t/tie_sdbm.t.................................FAILED
        2-4

[perlio/EN_US.UTF-8] -Duseithreads -Duse64bitall
    ../ext/SDBM_File/t/sdbm.t...................................FAILED
        6
        Bad plan.  You planned 80 tests but ran 7.
    ../lib/DBM_Filter/t/02core.t................................FAILED
        Bad plan.  You planned 189 tests but ran 4.
    ../lib/DBM_Filter/t/compress.t..............................FAILED
        Bad plan.  You planned 23 tests but ran 11.
    ../lib/DBM_Filter/t/encode.t................................FAILED
        14
        Bad plan.  You planned 26 tests but ran 24.
    ../lib/DBM_Filter/t/int32.t.................................FAILED
        Bad plan.  You planned 22 tests but ran 10.
    ../lib/DBM_Filter/t/null.t..................................FAILED
        Bad plan.  You planned 26 tests but ran 10.
    ../lib/DBM_Filter/t/utf8.t..................................FAILED
        13
        Bad plan.  You planned 20 tests but ran 18.
    ../lib/Memoize/t/tie_sdbm.t.................................FAILED
        2
        Bad plan.  You planned 4 tests but ran 2.

[stdio/perlio/EN_US.UTF-8] -DDEBUGGING -Duseithreads -Duse64bitall
    ../ext/SDBM_File/t/sdbm.t...................................FAILED
        6
        Bad plan.  You planned 80 tests but ran 7.
    ../lib/DBM_Filter/t/02core.t................................FAILED
        Bad plan.  You planned 189 tests but ran 4.
    ../lib/DBM_Filter/t/compress.t..............................FAILED
        Bad plan.  You planned 23 tests but ran 11.
    ../lib/DBM_Filter/t/encode.t................................FAILED
        14
        Bad plan.  You planned 26 tests but ran 24.
    ../lib/DBM_Filter/t/int32.t.................................FAILED
        Bad plan.  You planned 22 tests but ran 10.
    ../lib/DBM_Filter/t/null.t..................................FAILED
        Bad plan.  You planned 26 tests but ran 10.
    ../lib/DBM_Filter/t/utf8.t..................................FAILED
        13
        Bad plan.  You planned 20 tests but ran 18.
    ../lib/Memoize/t/tie_sdbm.t.................................FAILED
        No plan found in TAP output

MANIFEST did not declare 
'ext/Test/Harness/t/ext/Test/Harness/t/source_tests/harness'
MANIFEST did not declare 'lib/ExtUtils/CBuilder/compilet.exp'
MANIFEST did not declare 'lib/ExtUtils/CBuilder/compilet.exp_old'
MANIFEST did not declare 'lib/ExtUtils/ParseXS/t/XSTest.exp'
MANIFEST did not declare 'lib/ExtUtils/ParseXS/t/XSTest.exp_old'
MANIFEST did not declare 'lib/ExtUtils/ParseXS/t/compilet.exp'
MANIFEST did not declare 'lib/ExtUtils/ParseXS/t/compilet.exp_old'
MANIFEST did not declare 'patchlevel.bak'
MANIFEST did not declare 'rm.sh'
MANIFEST did not declare 'rmf.sh'
MANIFEST did not declare 't/compilet.exp'
MANIFEST did not declare 't/compilet.exp_old'
MANIFEST did not declare 't/md593966.dir'
MANIFEST did not declare 't/md593966.pag'
MANIFEST did not declare 't/md593986.dir'
MANIFEST did not declare 't/md593986.pag'
MANIFEST did not declare 't/md594026.dir'
MANIFEST did not declare 't/md594026.pag'
MANIFEST did not declare 't/md594046.dir'
MANIFEST did not declare 't/md594046.pag'
MANIFEST did not declare 't/md606208.dir'
MANIFEST did not declare 't/md606208.pag'
MANIFEST did not declare 't/md606248.dir'
MANIFEST did not declare 't/md606248.pag'
MANIFEST did not declare 't/md606250.dir'
MANIFEST did not declare 't/md606250.pag'
MANIFEST did not declare 't/md606268.dir'
MANIFEST did not declare 't/md606268.pag'
MANIFEST did not declare 't/md606306.dir'
MANIFEST did not declare 't/md606306.pag'
MANIFEST did not declare 't/md606406.dir'
MANIFEST did not declare 't/md606406.pag'
MANIFEST did not declare 't/md606432.dir'
MANIFEST did not declare 't/md606432.pag'
MANIFEST did not declare 't/md606444.dir'
MANIFEST did not declare 't/md606444.pag'
MANIFEST did not declare 't/md610342.dir'
MANIFEST did not declare 't/md610342.pag'
MANIFEST did not declare 't/md610498.dir'
MANIFEST did not declare 't/md610498.pag'
MANIFEST did not declare 't/md610556.dir'
MANIFEST did not declare 't/md610556.pag'
MANIFEST did not declare 't/md622596.dir'
MANIFEST did not declare 't/md622596.pag'
MANIFEST did not declare 't/md622602.dir'
MANIFEST did not declare 't/md622602.pag'
MANIFEST did not declare 't/md622608.dir'
MANIFEST did not declare 't/md622608.pag'
MANIFEST did not declare 't/md622622.dir'
MANIFEST did not declare 't/md622622.pag'
MANIFEST did not declare 't/md622628.dir'
MANIFEST did not declare 't/md622628.pag'
MANIFEST did not declare 't/md622632.dir'
MANIFEST did not declare 't/md622632.pag'
MANIFEST did not declare 't/md622644.dir'
MANIFEST did not declare 't/md622644.pag'
MANIFEST did not declare 't/md622678.dir'
MANIFEST did not declare 't/md622678.pag'
MANIFEST did not declare 't/md622682.dir'
MANIFEST did not declare 't/md622682.pag'
MANIFEST did not declare 't/md622692.dir'
MANIFEST did not declare 't/md622692.pag'
MANIFEST did not declare 't/md622732.dir'
MANIFEST did not declare 't/md622732.pag'
MANIFEST did not declare 't/md622746.dir'
MANIFEST did not declare 't/md622746.pag'
MANIFEST did not declare 't/md622748.dir'
MANIFEST did not declare 't/md622748.pag'
MANIFEST did not declare 't/md622766.dir'
MANIFEST did not declare 't/md622766.pag'
MANIFEST did not declare 't/md622778.dir'
MANIFEST did not declare 't/md622778.pag'
MANIFEST did not declare 't/md622786.dir'
MANIFEST did not declare 't/md622786.pag'
MANIFEST did not declare 't/md622844.dir'
MANIFEST did not declare 't/md622844.pag'
MANIFEST did not declare 't/md626690.dir'
MANIFEST did not declare 't/md626690.pag'
MANIFEST did not declare 't/md626712.dir'
MANIFEST did not declare 't/md626712.pag'
MANIFEST did not declare 't/md626790.dir'
MANIFEST did not declare 't/md626790.pag'
MANIFEST did not declare 't/md630828.dir'
MANIFEST did not declare 't/md630828.pag'
MANIFEST did not declare 't/md630848.dir'
MANIFEST did not declare 't/md630848.pag'
MANIFEST did not declare 't/md631030.dir'
MANIFEST did not declare 't/md631030.pag'
MANIFEST did not declare 't/md634892.dir'
MANIFEST did not declare 't/md634892.pag'
MANIFEST did not declare 't/md634918.dir'
MANIFEST did not declare 't/md634918.pag'
MANIFEST did not declare 't/md634954.dir'
MANIFEST did not declare 't/md634954.pag'
MANIFEST did not declare 't/md634956.dir'
MANIFEST did not declare 't/md634956.pag'
MANIFEST did not declare 't/md634974.dir'
MANIFEST did not declare 't/md634974.pag'
MANIFEST did not declare 't/md635020.dir'
MANIFEST did not declare 't/md635020.pag'
MANIFEST did not declare 't/md635108.dir'
MANIFEST did not declare 't/md635108.pag'
MANIFEST did not declare 't/md635122.dir'
MANIFEST did not declare 't/md635122.pag'
MANIFEST did not declare 't/md635128.dir'
MANIFEST did not declare 't/md635128.pag'
MANIFEST did not declare 't/md643108.dir'
MANIFEST did not declare 't/md643108.pag'
MANIFEST did not declare 't/md643152.dir'
MANIFEST did not declare 't/md643152.pag'
MANIFEST did not declare 't/md643194.dir'
MANIFEST did not declare 't/md643194.pag'
MANIFEST did not declare 't/md643252.dir'
MANIFEST did not declare 't/md643252.pag'
MANIFEST did not declare 't/md643254.dir'
MANIFEST did not declare 't/md643254.pag'
MANIFEST did not declare 't/md643284.dir'
MANIFEST did not declare 't/md643284.pag'
MANIFEST did not declare 't/md647264.dir'
MANIFEST did not declare 't/md647264.pag'
MANIFEST did not declare 't/md647350.dir'
MANIFEST did not declare 't/md647350.pag'
MANIFEST did not declare 't/md647370.dir'
MANIFEST did not declare 't/md647370.pag'
MANIFEST did not declare 't/md647380.dir'
MANIFEST did not declare 't/md647380.pag'
MANIFEST did not declare 't/md647390.dir'
MANIFEST did not declare 't/md647390.pag'
MANIFEST did not declare 't/md647400.dir'
MANIFEST did not declare 't/md647400.pag'
MANIFEST did not declare 't/md651276.dir'
MANIFEST did not declare 't/md651276.pag'
MANIFEST did not declare 't/md651364.dir'
MANIFEST did not declare 't/md651364.pag'
MANIFEST did not declare 't/md651410.dir'
MANIFEST did not declare 't/md651410.pag'
MANIFEST did not declare 't/md651444.dir'
MANIFEST did not declare 't/md651444.pag'
MANIFEST did not declare 't/md651474.dir'
MANIFEST did not declare 't/md651474.pag'
MANIFEST did not declare 't/md659464.dir'
MANIFEST did not declare 't/md659464.pag'
MANIFEST did not declare 't/md659472.dir'
MANIFEST did not declare 't/md659472.pag'
MANIFEST did not declare 't/md659504.dir'
MANIFEST did not declare 't/md659504.pag'
MANIFEST did not declare 't/md659514.dir'
MANIFEST did not declare 't/md659514.pag'
MANIFEST did not declare 't/md659638.dir'
MANIFEST did not declare 't/md659638.pag'
MANIFEST did not declare 't/md659658.dir'
MANIFEST did not declare 't/md659658.pag'
MANIFEST did not declare 't/md659694.dir'
MANIFEST did not declare 't/md659694.pag'
MANIFEST did not declare 't/md663554.dir'
MANIFEST did not declare 't/md663554.pag'
MANIFEST did not declare 't/md663562.dir'
MANIFEST did not declare 't/md663562.pag'
MANIFEST did not declare 't/md663628.dir'
MANIFEST did not declare 't/md663628.pag'
MANIFEST did not declare 't/md663630.dir'
MANIFEST did not declare 't/md663630.pag'
MANIFEST did not declare 't/md663638.dir'
MANIFEST did not declare 't/md663638.pag'
MANIFEST did not declare 't/md663694.dir'
MANIFEST did not declare 't/md663694.pag'
MANIFEST did not declare 't/md663772.dir'
MANIFEST did not declare 't/md663772.pag'
MANIFEST did not declare 't/md663784.dir'
MANIFEST did not declare 't/md663784.pag'
MANIFEST did not declare 't/md663794.dir'
MANIFEST did not declare 't/md663794.pag'
MANIFEST did not declare 't/md675906.dir'
MANIFEST did not declare 't/md675906.pag'
MANIFEST did not declare 't/md676056.dir'
MANIFEST did not declare 't/md676056.pag'
MANIFEST did not declare 't/md684066.dir'
MANIFEST did not declare 't/md684066.pag'
MANIFEST did not declare 't/md684076.dir'
MANIFEST did not declare 't/md684076.pag'
MANIFEST did not declare 't/md684086.dir'
MANIFEST did not declare 't/md684086.pag'
MANIFEST did not declare 't/md684092.dir'
MANIFEST did not declare 't/md684092.pag'
MANIFEST did not declare 't/md684118.dir'
MANIFEST did not declare 't/md684118.pag'
MANIFEST did not declare 't/md684138.dir'
MANIFEST did not declare 't/md684138.pag'
MANIFEST did not declare 't/md684156.dir'
MANIFEST did not declare 't/md684156.pag'
MANIFEST did not declare 't/md684168.dir'
MANIFEST did not declare 't/md684168.pag'
MANIFEST did not declare 't/md684170.dir'
MANIFEST did not declare 't/md684170.pag'
MANIFEST did not declare 't/md684218.dir'
MANIFEST did not declare 't/md684218.pag'
MANIFEST did not declare 't/md684220.dir'
MANIFEST did not declare 't/md684220.pag'
MANIFEST did not declare 't/md684222.dir'
MANIFEST did not declare 't/md684222.pag'
MANIFEST did not declare 't/md684226.dir'
MANIFEST did not declare 't/md684226.pag'
MANIFEST did not declare 't/md692266.dir'
MANIFEST did not declare 't/md692266.pag'
MANIFEST did not declare 't/md692306.dir'
MANIFEST did not declare 't/md692306.pag'
MANIFEST did not declare 't/md692332.dir'
MANIFEST did not declare 't/md692332.pag'
MANIFEST did not declare 't/md692352.dir'
MANIFEST did not declare 't/md692352.pag'
MANIFEST did not declare 't/md692398.dir'
MANIFEST did not declare 't/md692398.pag'
MANIFEST did not declare 't/md692418.dir'
MANIFEST did not declare 't/md692418.pag'
MANIFEST did not declare 't/md692436.dir'
MANIFEST did not declare 't/md692436.pag'
MANIFEST did not declare 't/md692438.dir'
MANIFEST did not declare 't/md692438.pag'
MANIFEST did not declare 't/md692446.dir'
MANIFEST did not declare 't/md692446.pag'
MANIFEST did not declare 't/md692456.dir'
MANIFEST did not declare 't/md692456.pag'
MANIFEST did not declare 't/md704516.dir'
MANIFEST did not declare 't/md704516.pag'
MANIFEST did not declare 't/md704526.dir'
MANIFEST did not declare 't/md704526.pag'
MANIFEST did not declare 't/md704546.dir'
MANIFEST did not declare 't/md704546.pag'
MANIFEST did not declare 't/md704566.dir'
MANIFEST did not declare 't/md704566.pag'
MANIFEST did not declare 't/md704572.dir'
MANIFEST did not declare 't/md704572.pag'
MANIFEST did not declare 't/md704602.dir'
MANIFEST did not declare 't/md704602.pag'
MANIFEST did not declare 't/md704606.dir'
MANIFEST did not declare 't/md704606.pag'
MANIFEST did not declare 't/md704608.dir'
MANIFEST did not declare 't/md704608.pag'
MANIFEST did not declare 't/md704632.dir'
MANIFEST did not declare 't/md704632.pag'
MANIFEST did not declare 't/md704718.dir'
MANIFEST did not declare 't/md704718.pag'
MANIFEST did not declare 't/md704728.dir'
MANIFEST did not declare 't/md704728.pag'
MANIFEST did not declare 't/md704762.dir'
MANIFEST did not declare 't/md704762.pag'
MANIFEST did not declare 't/md708626.dir'
MANIFEST did not declare 't/md708626.pag'
MANIFEST did not declare 't/md708672.dir'
MANIFEST did not declare 't/md708672.pag'
MANIFEST did not declare 't/md708690.dir'
MANIFEST did not declare 't/md708690.pag'
MANIFEST did not declare 't/md708692.dir'
MANIFEST did not declare 't/md708692.pag'
MANIFEST did not declare 't/md708712.dir'
MANIFEST did not declare 't/md708712.pag'
MANIFEST did not declare 't/md708726.dir'
MANIFEST did not declare 't/md708726.pag'
MANIFEST did not declare 't/md708794.dir'
MANIFEST did not declare 't/md708794.pag'
MANIFEST did not declare 't/md708850.dir'
MANIFEST did not declare 't/md708850.pag'
MANIFEST did not declare 't/md733266.dir'
MANIFEST did not declare 't/md733266.pag'
MANIFEST did not declare 't/md733286.dir'
MANIFEST did not declare 't/md733286.pag'
MANIFEST did not declare 't/md733298.dir'
MANIFEST did not declare 't/md733298.pag'
MANIFEST did not declare 't/md733356.dir'
MANIFEST did not declare 't/md733356.pag'
MANIFEST did not declare 't/md733398.dir'
MANIFEST did not declare 't/md733398.pag'
MANIFEST did not declare 't/md737286.dir'
MANIFEST did not declare 't/md737286.pag'
MANIFEST did not declare 't/md737296.dir'
MANIFEST did not declare 't/md737296.pag'
MANIFEST did not declare 't/md737384.dir'
MANIFEST did not declare 't/md737384.pag'
MANIFEST did not declare 't/md737396.dir'
MANIFEST did not declare 't/md737396.pag'
MANIFEST did not declare 't/md737442.dir'
MANIFEST did not declare 't/md737442.pag'
MANIFEST did not declare 't/md737466.dir'
MANIFEST did not declare 't/md737466.pag'
MANIFEST did not declare 't/md737486.dir'
MANIFEST did not declare 't/md737486.pag'
MANIFEST did not declare 't/md737496.dir'
MANIFEST did not declare 't/md737496.pag'
MANIFEST did not declare 't/md757780.dir'
MANIFEST did not declare 't/md757780.pag'
MANIFEST did not declare 't/md757800.dir'
MANIFEST did not declare 't/md757800.pag'
MANIFEST did not declare 't/md757810.dir'
MANIFEST did not declare 't/md757810.pag'
MANIFEST did not declare 't/md757818.dir'
MANIFEST did not declare 't/md757818.pag'
MANIFEST did not declare 't/md757824.dir'
MANIFEST did not declare 't/md757824.pag'
MANIFEST did not declare 't/md757846.dir'
MANIFEST did not declare 't/md757846.pag'
MANIFEST did not declare 't/md757858.dir'
MANIFEST did not declare 't/md757858.pag'
MANIFEST did not declare 't/md757868.dir'
MANIFEST did not declare 't/md757868.pag'
MANIFEST did not declare 't/md757870.dir'
MANIFEST did not declare 't/md757870.pag'
MANIFEST did not declare 't/md757876.dir'
MANIFEST did not declare 't/md757876.pag'
MANIFEST did not declare 't/md757890.dir'
MANIFEST did not declare 't/md757890.pag'
MANIFEST did not declare 't/md757902.dir'
MANIFEST did not declare 't/md757902.pag'
MANIFEST did not declare 't/md757908.dir'
MANIFEST did not declare 't/md757908.pag'
MANIFEST did not declare 't/md757910.dir'
MANIFEST did not declare 't/md757910.pag'
MANIFEST did not declare 't/md757926.dir'
MANIFEST did not declare 't/md757926.pag'
MANIFEST did not declare 't/md757928.dir'
MANIFEST did not declare 't/md757928.pag'
MANIFEST did not declare 't/md757946.dir'
MANIFEST did not declare 't/md757946.pag'
MANIFEST did not declare 't/md757976.dir'
MANIFEST did not declare 't/md757976.pag'
MANIFEST did not declare 't/md757990.dir'
MANIFEST did not declare 't/md757990.pag'
MANIFEST did not declare 't/md757996.dir'
MANIFEST did not declare 't/md757996.pag'
MANIFEST did not declare 't/md758002.dir'
MANIFEST did not declare 't/md758002.pag'
MANIFEST did not declare 't/md758012.dir'
MANIFEST did not declare 't/md758012.pag'

Compiler messages(aix):
"pp_sys.c", line 3042.22: 1506-280 (W) Function argument assignment between 
types "char*" and "const char*" is not allowed.

-- 
Report by Test::Smoke v1.35_01 build 1209 running on perl 5.8.8
(Reporter v0.033 / Smoker v0.041)


<Prev in Thread] Current Thread [Next in Thread>
  • Smoke [5.11.0] 35067 FAIL(F) AIX 5.2.0.0/ML04 (PPC/1 cpu), H.Merijn Brand <=