perl.daily-build.reports
[Top] [All Lists]

Smoke [5.8.8] 34450 FAIL(F) MSWin32 WinVista SP1 (AMD64/2 cpu)

Subject: Smoke [5.8.8] 34450 FAILF) MSWin32 WinVista SP1 (AMD64/2 cpu
From: Jan Dubois
Date: Thu, 2 Oct 2008 06:02 -0700
Newsgroups: perl.daily-build.reports

Automated smoke report for 5.8.8 patch 34450
T-REX: AMD Athlon(tm) 64 X2 Dual Core Processor 3800+(~2009 MHz) (AMD64/2 cpu)
    on        MSWin32 - WinVista SP1
    using     cl version 12.00.8168
    smoketime 2 hours 21 minutes (average 17 minutes 44 seconds)

Summary: FAIL(F)

O = OK  F = Failure(s), extended report at the bottom
X = Failure(s) under TEST but not under harness
? = still running or test results not (yet) available
Build failures during:       - = unknown or N/A
c = Configure, m = make, M = make (after miniperl), t = make test-prep

   34450     Configuration (common) none
----------- ---------------------------------------------------------
O O         
F O         -Duselargefiles
F O         -Duseithreads
F O         -Duseithreads -Duselargefiles
| +--------- -DDEBUGGING
+----------- no debugging


Locally applied patches:
    MAINT34300
    SMOKE34450

Failures: (common-args) none
[default] -Duselargefiles
    ../lib/ExtUtils/t/Constant.t............FAILED 223

[default] -Duseithreads
    ../lib/ExtUtils/t/prereq.t..............FAILED 13

[default] -Duseithreads -Duselargefiles
    ../lib/ExtUtils/t/INST.t................FAILED 26

Compiler messages(MSWin32):
..\pp_sys.c(3021) : warning C4761: integral size mismatch in argument; 
conversion supplied

-- 
Report by Test::Smoke v1.35 build 1199 running on perl 5.10.0
(Reporter v0.033 / Smoker v0.041)


<Prev in Thread] Current Thread [Next in Thread>
  • Smoke [5.8.8] 34450 FAIL(F) MSWin32 WinVista SP1 (AMD64/2 cpu), Jan Dubois <=