perl.daily-build.reports
[Top] [All Lists]

Smoke [5.11.0] 34321 FAIL(F) HP-UX B.11.11/64 (PA-RISC2.0/64/2 cpu)

Subject: Smoke [5.11.0] 34321 FAILF) HP-UX B.11.11/64 (PA-RISC2.0/64/2 cpu
From: H.Merijn Brand
Date: Tue, 9 Sep 2008 19:45 +0200
Newsgroups: perl.daily-build.reports

Automated smoke report for 5.11.0 patch 34321
r3: PA8800 (PA-RISC2.0/64/2 cpu)
    on        HP-UX - B.11.11/64
    using     gcc version 4.2.4
    smoketime 11 hours 14 minutes (average 1 hour 24 minutes)

Summary: FAIL(F)

O = OK  F = Failure(s), extended report at the bottom
X = Failure(s) under TEST but not under harness
? = still running or test results not (yet) available
Build failures during:       - = unknown or N/A
c = Configure, m = make, M = make (after miniperl), t = make test-prep

   34321     Configuration (common) -Dcc=gcc
----------- ---------------------------------------------------------
F F F F F F 
F F F F F F -Duse64bitall
F F F F F F -Duseithreads
F F F F F F -Duseithreads -Duse64bitall
| | | | | +- LC_ALL = univ.utf8 -DDEBUGGING
| | | | +--- PERLIO = perlio -DDEBUGGING
| | | +----- PERLIO = stdio  -DDEBUGGING
| | +------- LC_ALL = univ.utf8
| +--------- PERLIO = perlio
+----------- PERLIO = stdio 

Locally applied patches:
    DEVEL
    SMOKE34321

Tests skipped on user request:
    lib/Test/Simple/t/utf8.t
Failures: (common-args) -Dcc=gcc
[stdio/perlio] 
[stdio/perlio] -DDEBUGGING
[stdio/perlio] -Duse64bitall
[stdio/perlio] -DDEBUGGING -Duse64bitall
[stdio/perlio] -Duseithreads
[stdio/perlio] -DDEBUGGING -Duseithreads
[stdio/perlio] -Duseithreads -Duse64bitall
[stdio/perlio] -DDEBUGGING -Duseithreads -Duse64bitall
    ../ext/IO/t/io_multihomed.t.................................FAILED
        Bad plan.  You planned 8 tests but ran 1.
    ../ext/IO/t/io_sock.t.......................................FAILED
        Bad plan.  You planned 26 tests but ran 1.
    ../ext/IO/t/io_udp.t........................................FAILED
        Bad plan.  You planned 7 tests but ran 0.
    ../ext/Socket/t/Socket.t....................................FAILED
        Bad plan.  You planned 17 tests but ran 2.
    ../lib/Net/Ping/t/450_service.t.............................FAILED
        Bad plan.  You planned 26 tests but ran 3.
    ../lib/Net/Ping/t/510_ping_udp.t............................FAILED
        Bad plan.  You planned 2 tests but ran 1.

[univ.utf8] 
[univ.utf8] -DDEBUGGING
[univ.utf8] -Duse64bitall
[univ.utf8] -DDEBUGGING -Duse64bitall
[univ.utf8] -Duseithreads
[univ.utf8] -DDEBUGGING -Duseithreads
[univ.utf8] -Duseithreads -Duse64bitall
[univ.utf8] -DDEBUGGING -Duseithreads -Duse64bitall
    ../ext/IO/t/io_multihomed.t.................................FAILED
        Bad plan.  You planned 8 tests but ran 1.
    ../ext/IO/t/io_sock.t.......................................FAILED
        Bad plan.  You planned 26 tests but ran 1.
    ../ext/IO/t/io_udp.t........................................FAILED
        Bad plan.  You planned 7 tests but ran 0.
    ../ext/Socket/t/Socket.t....................................FAILED
        Bad plan.  You planned 17 tests but ran 2.
    ../lib/Net/Ping/t/450_service.t.............................FAILED
        Bad plan.  You planned 26 tests but ran 3.
    ../lib/Net/Ping/t/510_ping_udp.t............................FAILED
        Bad plan.  You planned 2 tests but ran 1.
    ../lib/Pod/t/man-options.t..................................FAILED
        3

Compiler messages(gcc):
pp_sys.c: In function 'Perl_pp_gpwent':
pp_sys.c:5168: warning: implicit declaration of function 'getspnam_r'

-- 
Report by Test::Smoke v1.29_63 build 1202 running on perl 5.8.8
(Reporter v0.033 / Smoker v0.041)


<Prev in Thread] Current Thread [Next in Thread>