perl.daily-build.reports
[Top] [All Lists]

Smoke [5.11.0] 34384 FAIL(F) HP-UX B.11.23/64 (ia64/2 cpu)

Subject: Smoke [5.11.0] 34384 FAILF) HP-UX B.11.23/64 (ia64/2 cpu
From: Smoketest Removethispart
Date: Sun, 21 Sep 2008 07:33 -0700
Newsgroups: perl.daily-build.reports

Automated smoke report for 5.11.0 patch 34384
hairball: Intel(R) Itanium 2 processor/1400 MHz (ia64/2 cpu)
    on        HP-UX - B.11.23/64
    using     cc version B3910B
    smoketime 12 hours 32 minutes (average 47 minutes 2 seconds)

Summary: FAIL(F)

O = OK  F = Failure(s), extended report at the bottom
X = Failure(s) under TEST but not under harness
? = still running or test results not (yet) available
Build failures during:       - = unknown or N/A
c = Configure, m = make, M = make (after miniperl), t = make test-prep

   34384     Configuration (common) none
----------- ---------------------------------------------------------
O O O O     
O O O O     -Duse64bitint
F F F F     -Duselongdouble
O O O O     -Dusemorebits
O O O O     -Duseithreads
O O O O     -Duseithreads -Duse64bitint
F F F F     -Duseithreads -Duselongdouble
O O O O     -Duseithreads -Dusemorebits
| | | +----- PERLIO = perlio -DDEBUGGING
| | +------- PERLIO = stdio  -DDEBUGGING
| +--------- PERLIO = perlio
+----------- PERLIO = stdio


Locally applied patches:
    DEVEL
    SMOKE34384

Failures: (common-args) none
[stdio/perlio] -Duselongdouble
[stdio/perlio] -DDEBUGGING -Duselongdouble
[stdio/perlio] -Duseithreads -Duselongdouble
[stdio/perlio] -DDEBUGGING -Duseithreads -Duselongdouble
    ../ext/Math/BigInt/FastCalc/t/bigintfc.t....................FAILED
        308, 325
    ../lib/Math/BigInt/t/bare_mbi.t.............................FAILED
        1976, 2958, 3240
    ../lib/Math/BigInt/t/bigintc.t..............................FAILED
        329
    ../lib/Math/BigInt/t/bigintpm.t.............................FAILED
        1982, 2964, 3246
    ../lib/Math/BigInt/t/sub_mbi.t..............................FAILED
        1976, 2958, 3240
    ../lib/Math/BigInt/t/upgrade.t..............................FAILED
        2107

-- 
Report by Test::Smoke v1.29_63 build 1202 running on perl 5.8.8
(Reporter v0.033 / Smoker v0.041)


<Prev in Thread] Current Thread [Next in Thread>
  • Smoke [5.11.0] 34384 FAIL(F) HP-UX B.11.23/64 (ia64/2 cpu), Smoketest Removethispart <=