perl.daily-build.reports
[Top] [All Lists]

Smoke [5.8.8] 34368 FAIL(F) netbsd 3.1 (i386/1 cpu)

Subject: Smoke [5.8.8] 34368 FAILF) netbsd 3.1 (i386/1 cpu
From: Abe Timmerman
Date: Tue, 16 Sep 2008 12:22 +0200
Newsgroups: perl.daily-build.reports

Automated smoke report for 5.8.8 patch 34368
wodan.test-smoke.org: Intel Pentium III (686-class) (i386/1 cpu)
    on        netbsd - 3.1
    using     cc version 3.3.3 (NetBSD nb3 20040520)
    smoketime 5 hours 29 minutes (average 32 minutes 58 seconds)

Summary: FAIL(F)

O = OK  F = Failure(s), extended report at the bottom
X = Failure(s) under TEST but not under harness
? = still running or test results not (yet) available
Build failures during:       - = unknown or N/A
c = Configure, m = make, M = make (after miniperl), t = make test-prep

   34368     Configuration (common) none
----------- ---------------------------------------------------------
F - F -     -Uuseperlio
F F F F     
F F F F     -Duse64bitint
F F F F     -Duseithreads
F F F F     -Duseithreads -Duse64bitint
| | | +----- PERLIO = perlio -DDEBUGGING
| | +------- PERLIO = stdio  -DDEBUGGING
| +--------- PERLIO = perlio
+----------- PERLIO = stdio


Locally applied patches:
    MAINT34300
    SMOKE34368

Failures: (common-args) none
[stdio] -Uuseperlio
    ../t/io/open.t..........................FAILED 93

[stdio] -DDEBUGGING -Uuseperlio
    ../t/io/open.t..........................FAILED 93
Inconsistent test results (between TEST and harness):
    ../lib/Benchmark.t......................FAILED at test 126

[stdio/perlio] 
[stdio/perlio] -DDEBUGGING
[stdio/perlio] -Duse64bitint
[perlio] -DDEBUGGING -Duse64bitint
[stdio] -Duseithreads
[stdio/perlio] -DDEBUGGING -Duseithreads
[stdio/perlio] -Duseithreads -Duse64bitint
[stdio/perlio] -DDEBUGGING -Duseithreads -Duse64bitint
    ../t/io/dup.t...........................FAILED 15-16
    ../t/io/open.t..........................FAILED 93

[stdio] -DDEBUGGING -Duse64bitint
    ../t/io/dup.t...........................FAILED 15-16
    ../t/io/open.t..........................FAILED 93
Inconsistent test results (between TEST and harness):
    ../lib/Benchmark.t......................FAILED at test 126

[perlio] -Duseithreads
    ../t/io/dup.t...........................FAILED 15-16
    ../t/io/open.t..........................FAILED 93
Inconsistent test results (between TEST and harness):
    ../ext/threads/t/thread.t...............FAILED--expected 34 tests, saw 24

Compiler messages(gcc):
regcomp.c: In function `S_study_chunk':
regcomp.c:683: warning: comparison between signed and unsigned
regcomp.c:1037: warning: comparison between signed and unsigned
regcomp.c:1579: warning: comparison between signed and unsigned
regcomp.c:1634: warning: comparison between signed and unsigned
regcomp.c: In function `Perl_pregcomp':
regcomp.c:1832: warning: comparison between signed and unsigned
regcomp.c:1832: warning: signed and unsigned type in conditional expression
perlio.c: In function `PerlIO_apply_layers':
perlio.c:247: warning: unused parameter `f'
perlio.c:247: warning: unused parameter `mode'
perlio.c: In function `PerlIO_binmode':
perlio.c:269: warning: unused parameter `names'
perlio.c: In function `PerlIO_fdupopen':
perlio.c:282: warning: unused parameter `param'
perlio.c:282: warning: unused parameter `flags'
perlio.c: In function `PerlIO_openn':
perlio.c:323: warning: unused parameter `layers'
<command line>:12:1: warning: "TIME_HIRES_STAT" redefined
<command line>:11:1: warning: this is the location of the previous definition
<command line>:14:1: warning: "TIME_HIRES_STAT" redefined
<command line>:13:1: warning: this is the location of the previous definition

-- 
Report by Test::Smoke v1.35 build 1203 running on perl 5.8.8
(Reporter v0.033 / Smoker v0.041)


<Prev in Thread] Current Thread [Next in Thread>
  • Smoke [5.8.8] 34368 FAIL(F) netbsd 3.1 (i386/1 cpu), Abe Timmerman <=