perl.daily-build.reports
[Top] [All Lists]

Smoke [5.11.0] 34380 FAIL(F) HP-UX B.10.20 (PA-RISC2.0/32/1 cpu)

Subject: Smoke [5.11.0] 34380 FAILF) HP-UX B.10.20 (PA-RISC2.0/32/1 cpu
From: H.Merijn Brand
Date: Sun, 21 Sep 2008 17:24 +0200
Newsgroups: perl.daily-build.reports

Automated smoke report for 5.11.0 patch 34380
d3: PA8000 (PA-RISC2.0/32/1 cpu)
    on        HP-UX - B.10.20
    using     gcc version 3.4.6
    smoketime 21 hours 54 minutes (average 5 hours 28 minutes)

Summary: FAIL(F)

O = OK  F = Failure(s), extended report at the bottom
X = Failure(s) under TEST but not under harness
? = still running or test results not (yet) available
Build failures during:       - = unknown or N/A
c = Configure, m = make, M = make (after miniperl), t = make test-prep

   34380     Configuration (common) -Dcc=gcc
----------- ---------------------------------------------------------
F F F F F F 
F F F F F F -Duseithreads
| | | | | +- LC_ALL = univ.utf8 -DDEBUGGING
| | | | +--- PERLIO = perlio -DDEBUGGING
| | | +----- PERLIO = stdio  -DDEBUGGING
| | +------- LC_ALL = univ.utf8
| +--------- PERLIO = perlio
+----------- PERLIO = stdio 

Locally applied patches:
    DEVEL
    SMOKE34380

Tests skipped on user request:
    lib/Test/Simple/t/utf8.t
Failures: (common-args) -Dcc=gcc
[stdio/perlio/univ.utf8] 
[stdio/perlio/univ.utf8] -DDEBUGGING
    ../lib/Math/Trig.t..........................................FAILED
        100, 102, 109, 111, 125, 127, 131, 133

[stdio] -Duseithreads
[stdio] -DDEBUGGING -Duseithreads
    ../lib/Math/Trig.t..........................................FAILED
        100, 102, 109, 111, 125, 127, 131, 133
    ../t/op/regexp_qr_embed_thr.t...............................FAILED
        317-326, 330-340, 344, 346-349, 352-355
        357-366, 368-377
        Bad plan.  You planned 1353 tests but ran 377.

[perlio/univ.utf8] -Duseithreads
[perlio/univ.utf8] -DDEBUGGING -Duseithreads
    ../lib/Math/Trig.t..........................................FAILED
        100, 102, 109, 111, 125, 127, 131, 133
    ../t/op/regexp_qr_embed_thr.t...............................FAILED
        317-326, 330-340, 344, 346-349, 352-355
        357-366, 368-372
        Bad plan.  You planned 1353 tests but ran 372.

MANIFEST did not declare 'a.out'
MANIFEST did not declare 
'ext/Test/Harness/t/ext/Test/Harness/t/source_tests/harness'
MANIFEST did not declare 'patchlevel.bak'

Compiler messages(gcc):
try.c: In function `main':
try.c:53: error: request for member `fds_bits' in something not a structure or 
union
try.c:56: warning: passing arg 2 of `select' from incompatible pointer type
try.c:57: error: request for member `fds_bits' in something not a structure or 
union
miniperlmain.c: In function `main':
miniperlmain.c:98: warning: implicit declaration of function `pthread_atfork'
perl.c: In function `perl_fini':
perl.c:1428: warning: implicit declaration of function `pthread_key_delete'
pp_sys.c: In function `Perl_pp_send':
pp_sys.c:1982: warning: passing arg 2 of `cma_send' discards qualifiers from 
pointer target type
pp_sys.c: In function `Perl_pp_gmtime':
pp_sys.c:4470: warning: implicit declaration of function `localtime_r'
pp_sys.c:4473: warning: implicit declaration of function `gmtime_r'
perlmain.c: In function `main':
perlmain.c:98: warning: implicit declaration of function `pthread_atfork'

-- 
Report by Test::Smoke v1.29_63 build 1202 running on perl 5.8.8
(Reporter v0.033 / Smoker v0.041)


<Prev in Thread] Current Thread [Next in Thread>