perl.daily-build.reports
[Top] [All Lists]

Smoke [5.11.0] 34170 FAIL(X) AIX 5.2.0.0/ML04 (PPC/1 cpu)

Subject: Smoke [5.11.0] 34170 FAILX) AIX 5.2.0.0/ML04 (PPC/1 cpu
From: H.Merijn Brand
Date: Wed, 6 Aug 2008 14:20 +0200
Newsgroups: perl.daily-build.reports

Automated smoke report for 5.11.0 patch 34170
i4: PPC_POWER4 (PPC/1 cpu)
    on        AIX - 5.2.0.0/ML04
    using     xlc -q32 version 9.0.0.0
    smoketime 14 hours 59 minutes (average 1 hour 14 minutes)

Summary: FAIL(X)

O = OK  F = Failure(s), extended report at the bottom
X = Failure(s) under TEST but not under harness
? = still running or test results not (yet) available
Build failures during:       - = unknown or N/A
c = Configure, m = make, M = make (after miniperl), t = make test-prep

   34170     Configuration (common) none
----------- ---------------------------------------------------------
O O X O O X 
O O X O O X -Duse64bitint
X X X X X X -Duse64bitall
O O X O O X -Duseithreads
O O X O O X -Duseithreads -Duse64bitint
X X X X X X -Duseithreads -Duse64bitall
| | | | | +- LC_ALL = EN_US.UTF-8 -DDEBUGGING
| | | | +--- PERLIO = perlio -DDEBUGGING
| | | +----- PERLIO = stdio  -DDEBUGGING
| | +------- LC_ALL = EN_US.UTF-8
| +--------- PERLIO = perlio
+----------- PERLIO = stdio 

Locally applied patches:
    DEVEL
    SMOKE34170

Failures: (common-args) none
[EN_US.UTF-8] 
[EN_US.UTF-8] -DDEBUGGING
[EN_US.UTF-8] -Duse64bitint
[EN_US.UTF-8] -DDEBUGGING -Duse64bitint
[EN_US.UTF-8] -Duseithreads
[EN_US.UTF-8] -DDEBUGGING -Duseithreads
[EN_US.UTF-8] -Duseithreads -Duse64bitint
[EN_US.UTF-8] -DDEBUGGING -Duseithreads -Duse64bitint
Inconsistent test results (between TEST and harness):
    ../lib/Pod/t/man-options.t..............FAILED at test 3

[stdio/perlio] -Duse64bitall
Inconsistent test results (between TEST and harness):
    ../lib/DBM_Filter/t/02core.t............FAILED--expected 189 tests, saw 4
    ../lib/DBM_Filter/t/utf8.t..............FAILED--expected 20 tests, saw 12
    ../ext/SDBM_File/t/sdbm.t...............FAILED--no leader found
    ../lib/Memoize/t/tie_sdbm.t.............FAILED--no leader found
    ../lib/DBM_Filter/t/compress.t..........FAILED--expected 23 tests, saw 11
    ../lib/DBM_Filter/t/encode.t............FAILED--expected 26 tests, saw 13
    ../lib/DBM_Filter/t/int32.t.............FAILED--expected 22 tests, saw 10
    ../lib/DBM_Filter/t/null.t..............FAILED--expected 26 tests, saw 10

[EN_US.UTF-8] -Duse64bitall
[EN_US.UTF-8] -DDEBUGGING -Duse64bitall
Inconsistent test results (between TEST and harness):
    ../lib/DBM_Filter/t/02core.t............FAILED--expected 189 tests, saw 4
    ../lib/DBM_Filter/t/encode.t............FAILED--expected 26 tests, saw 13
    ../lib/DBM_Filter/t/null.t..............FAILED--expected 26 tests, saw 10
    ../lib/DBM_Filter/t/utf8.t..............FAILED--expected 20 tests, saw 12
    ../ext/SDBM_File/t/sdbm.t...............FAILED--no leader found
    ../lib/Memoize/t/tie_sdbm.t.............FAILED--no leader found
    ../lib/DBM_Filter/t/compress.t..........FAILED--expected 23 tests, saw 11
    ../lib/DBM_Filter/t/int32.t.............FAILED--expected 22 tests, saw 10
    ../lib/Pod/t/man-options.t..............FAILED at test 3

[stdio/perlio] -DDEBUGGING -Duse64bitall
Inconsistent test results (between TEST and harness):
    ../lib/DBM_Filter/t/02core.t............FAILED--expected 189 tests, saw 4
    ../lib/DBM_Filter/t/encode.t............FAILED--expected 26 tests, saw 13
    ../lib/DBM_Filter/t/null.t..............FAILED--expected 26 tests, saw 10
    ../lib/DBM_Filter/t/utf8.t..............FAILED--expected 20 tests, saw 12
    ../ext/SDBM_File/t/sdbm.t...............FAILED--no leader found
    ../lib/Memoize/t/tie_sdbm.t.............FAILED--no leader found
    ../lib/DBM_Filter/t/compress.t..........FAILED--expected 23 tests, saw 11
    ../lib/DBM_Filter/t/int32.t.............FAILED--expected 22 tests, saw 10

[stdio] -Duseithreads -Duse64bitall
Inconsistent test results (between TEST and harness):
    ../lib/DBM_Filter/t/02core.t............FAILED--expected 189 tests, saw 4
    ../lib/DBM_Filter/t/encode.t............FAILED--expected 26 tests, saw 13
    ../lib/DBM_Filter/t/null.t..............FAILED--expected 26 tests, saw 10
    ../lib/DBM_Filter/t/utf8.t..............FAILED--expected 20 tests, saw 12
    ../ext/SDBM_File/t/sdbm.t...............FAILED at test 6
    ../lib/Memoize/t/tie_sdbm.t.............FAILED--no leader found
    ../lib/DBM_Filter/t/compress.t..........FAILED--expected 23 tests, saw 11
    ../lib/DBM_Filter/t/int32.t.............FAILED--expected 22 tests, saw 10

[perlio] -Duseithreads -Duse64bitall
Inconsistent test results (between TEST and harness):
    ../lib/DBM_Filter/t/02core.t............FAILED--expected 189 tests, saw 4
    ../lib/DBM_Filter/t/encode.t............FAILED--expected 26 tests, saw 13
    ../lib/DBM_Filter/t/null.t..............FAILED--expected 26 tests, saw 10
    ../lib/DBM_Filter/t/utf8.t..............FAILED--expected 20 tests, saw 12
    ../ext/SDBM_File/t/sdbm.t...............FAILED at test 6
    ../lib/Memoize/t/tie_sdbm.t.............FAILED at test 2
    ../lib/DBM_Filter/t/compress.t..........FAILED--expected 23 tests, saw 11
    ../lib/DBM_Filter/t/int32.t.............FAILED--expected 22 tests, saw 10

[EN_US.UTF-8] -Duseithreads -Duse64bitall
Inconsistent test results (between TEST and harness):
    ../lib/DBM_Filter/t/02core.t............FAILED--expected 189 tests, saw 4
    ../lib/DBM_Filter/t/encode.t............FAILED--expected 26 tests, saw 13
    ../lib/DBM_Filter/t/null.t..............FAILED--expected 26 tests, saw 10
    ../lib/DBM_Filter/t/utf8.t..............FAILED--expected 20 tests, saw 12
    ../ext/SDBM_File/t/sdbm.t...............FAILED at test 6
    ../lib/Memoize/t/tie_sdbm.t.............FAILED at test 2
    ../lib/DBM_Filter/t/compress.t..........FAILED--expected 23 tests, saw 11
    ../lib/DBM_Filter/t/int32.t.............FAILED--expected 22 tests, saw 10
    ../lib/Pod/t/man-options.t..............FAILED at test 3

[stdio] -DDEBUGGING -Duseithreads -Duse64bitall
Inconsistent test results (between TEST and harness):
    ../lib/DBM_Filter/t/02core.t............FAILED--expected 189 tests, saw 4
    ../lib/DBM_Filter/t/encode.t............FAILED at test 14
    ../lib/DBM_Filter/t/null.t..............FAILED--expected 26 tests, saw 10
    ../lib/DBM_Filter/t/utf8.t..............FAILED at test 13
    ../ext/SDBM_File/t/sdbm.t...............FAILED at test 6
    ../lib/Memoize/t/tie_sdbm.t.............FAILED at test 2
    ../lib/DBM_Filter/t/compress.t..........FAILED--expected 23 tests, saw 11
    ../lib/DBM_Filter/t/int32.t.............FAILED--expected 22 tests, saw 10

[perlio] -DDEBUGGING -Duseithreads -Duse64bitall
Inconsistent test results (between TEST and harness):
    ../lib/DBM_Filter/t/02core.t............FAILED--expected 189 tests, saw 4
    ../lib/DBM_Filter/t/encode.t............FAILED at test 14
    ../lib/DBM_Filter/t/null.t..............FAILED--expected 26 tests, saw 10
    ../lib/DBM_Filter/t/utf8.t..............FAILED at test 13
    ../ext/SDBM_File/t/sdbm.t...............FAILED at test 6
    ../lib/Memoize/t/tie_sdbm.t.............FAILED--no leader found
    ../lib/DBM_Filter/t/compress.t..........FAILED--expected 23 tests, saw 11
    ../lib/DBM_Filter/t/int32.t.............FAILED--expected 22 tests, saw 10

[EN_US.UTF-8] -DDEBUGGING -Duseithreads -Duse64bitall
Inconsistent test results (between TEST and harness):
    ../lib/DBM_Filter/t/02core.t............FAILED--expected 189 tests, saw 4
    ../lib/DBM_Filter/t/encode.t............FAILED at test 14
    ../lib/DBM_Filter/t/null.t..............FAILED--expected 26 tests, saw 10
    ../lib/DBM_Filter/t/utf8.t..............FAILED at test 13
    ../ext/SDBM_File/t/sdbm.t...............FAILED at test 6
    ../lib/Memoize/t/tie_sdbm.t.............FAILED--no leader found
    ../lib/DBM_Filter/t/compress.t..........FAILED--expected 23 tests, saw 11
    ../lib/DBM_Filter/t/int32.t.............FAILED--expected 22 tests, saw 10
    ../lib/Pod/t/man-options.t..............FAILED at test 3

MANIFEST did not declare 'lib/ExtUtils/CBuilder/compilet.exp'
MANIFEST did not declare 'lib/ExtUtils/CBuilder/compilet.exp_old'
MANIFEST did not declare 'lib/ExtUtils/ParseXS/t/XSTest.exp'
MANIFEST did not declare 'lib/ExtUtils/ParseXS/t/XSTest.exp_old'
MANIFEST did not declare 'lib/ExtUtils/ParseXS/t/compilet.exp'
MANIFEST did not declare 'lib/ExtUtils/ParseXS/t/compilet.exp_old'
MANIFEST did not declare 'patchlevel.bak'
MANIFEST did not declare 'rm.sh'
MANIFEST did not declare 'rmf.sh'
MANIFEST did not declare 't/compilet.exp'
MANIFEST did not declare 't/compilet.exp_old'
MANIFEST did not declare 't/md315402.dir'
MANIFEST did not declare 't/md315402.pag'
MANIFEST did not declare 't/md315566.dir'
MANIFEST did not declare 't/md315566.pag'
MANIFEST did not declare 't/md315592.dir'
MANIFEST did not declare 't/md315592.pag'
MANIFEST did not declare 't/md397320.dir'
MANIFEST did not declare 't/md397320.pag'
MANIFEST did not declare 't/md397444.dir'
MANIFEST did not declare 't/md397444.pag'
MANIFEST did not declare 't/md397464.dir'
MANIFEST did not declare 't/md397464.pag'
MANIFEST did not declare 't/md491530.dir'
MANIFEST did not declare 't/md491530.pag'
MANIFEST did not declare 't/md491534.dir'
MANIFEST did not declare 't/md491534.pag'
MANIFEST did not declare 't/md491570.dir'
MANIFEST did not declare 't/md491570.pag'
MANIFEST did not declare 't/md491610.dir'
MANIFEST did not declare 't/md491610.pag'
MANIFEST did not declare 't/md491746.dir'
MANIFEST did not declare 't/md491746.pag'
MANIFEST did not declare 't/md491766.dir'
MANIFEST did not declare 't/md491766.pag'
MANIFEST did not declare 't/md503828.dir'
MANIFEST did not declare 't/md503828.pag'
MANIFEST did not declare 't/md503848.dir'
MANIFEST did not declare 't/md503848.pag'
MANIFEST did not declare 't/md503852.dir'
MANIFEST did not declare 't/md503852.pag'
MANIFEST did not declare 't/md503858.dir'
MANIFEST did not declare 't/md503858.pag'
MANIFEST did not declare 't/md503878.dir'
MANIFEST did not declare 't/md503878.pag'
MANIFEST did not declare 't/md503896.dir'
MANIFEST did not declare 't/md503896.pag'
MANIFEST did not declare 't/md503908.dir'
MANIFEST did not declare 't/md503908.pag'
MANIFEST did not declare 't/md503916.dir'
MANIFEST did not declare 't/md503916.pag'
MANIFEST did not declare 't/md503932.dir'
MANIFEST did not declare 't/md503932.pag'
MANIFEST did not declare 't/md503998.dir'
MANIFEST did not declare 't/md503998.pag'
MANIFEST did not declare 't/md504018.dir'
MANIFEST did not declare 't/md504018.pag'
MANIFEST did not declare 't/md504032.dir'
MANIFEST did not declare 't/md504032.pag'
MANIFEST did not declare 't/md565292.dir'
MANIFEST did not declare 't/md565292.pag'
MANIFEST did not declare 't/md565310.dir'
MANIFEST did not declare 't/md565310.pag'
MANIFEST did not declare 't/md565326.dir'
MANIFEST did not declare 't/md565326.pag'
MANIFEST did not declare 't/md565346.dir'
MANIFEST did not declare 't/md565346.pag'
MANIFEST did not declare 't/md565348.dir'
MANIFEST did not declare 't/md565348.pag'
MANIFEST did not declare 't/md565366.dir'
MANIFEST did not declare 't/md565366.pag'
MANIFEST did not declare 't/md565398.dir'
MANIFEST did not declare 't/md565398.pag'
MANIFEST did not declare 't/md569384.dir'
MANIFEST did not declare 't/md569384.pag'
MANIFEST did not declare 't/md569408.dir'
MANIFEST did not declare 't/md569408.pag'
MANIFEST did not declare 't/md569478.dir'
MANIFEST did not declare 't/md569478.pag'
MANIFEST did not declare 't/md569498.dir'
MANIFEST did not declare 't/md569498.pag'
MANIFEST did not declare 't/md569564.dir'
MANIFEST did not declare 't/md569564.pag'
MANIFEST did not declare 't/md569588.dir'
MANIFEST did not declare 't/md569588.pag'
MANIFEST did not declare 't/md585732.dir'
MANIFEST did not declare 't/md585732.pag'
MANIFEST did not declare 't/md585738.dir'
MANIFEST did not declare 't/md585738.pag'
MANIFEST did not declare 't/md585768.dir'
MANIFEST did not declare 't/md585768.pag'
MANIFEST did not declare 't/md585812.dir'
MANIFEST did not declare 't/md585812.pag'
MANIFEST did not declare 't/md585820.dir'
MANIFEST did not declare 't/md585820.pag'
MANIFEST did not declare 't/md585834.dir'
MANIFEST did not declare 't/md585834.pag'
MANIFEST did not declare 't/md585854.dir'
MANIFEST did not declare 't/md585854.pag'
MANIFEST did not declare 't/md585858.dir'
MANIFEST did not declare 't/md585858.pag'
MANIFEST did not declare 't/md585908.dir'
MANIFEST did not declare 't/md585908.pag'
MANIFEST did not declare 't/md585914.dir'
MANIFEST did not declare 't/md585914.pag'
MANIFEST did not declare 't/md585932.dir'
MANIFEST did not declare 't/md585932.pag'
MANIFEST did not declare 't/md585956.dir'
MANIFEST did not declare 't/md585956.pag'
MANIFEST did not declare 't/md585978.dir'
MANIFEST did not declare 't/md585978.pag'
MANIFEST did not declare 't/md589880.dir'
MANIFEST did not declare 't/md589880.pag'
MANIFEST did not declare 't/md589932.dir'
MANIFEST did not declare 't/md589932.pag'
MANIFEST did not declare 't/md589954.dir'
MANIFEST did not declare 't/md589954.pag'
MANIFEST did not declare 't/md593948.dir'
MANIFEST did not declare 't/md593948.pag'
MANIFEST did not declare 't/md593972.dir'
MANIFEST did not declare 't/md593972.pag'
MANIFEST did not declare 't/md593996.dir'
MANIFEST did not declare 't/md593996.pag'
MANIFEST did not declare 't/md594068.dir'
MANIFEST did not declare 't/md594068.pag'
MANIFEST did not declare 't/md594078.dir'
MANIFEST did not declare 't/md594078.pag'
MANIFEST did not declare 't/md594100.dir'
MANIFEST did not declare 't/md594100.pag'
MANIFEST did not declare 't/md594116.dir'
MANIFEST did not declare 't/md594116.pag'
MANIFEST did not declare 't/md594120.dir'
MANIFEST did not declare 't/md594120.pag'
MANIFEST did not declare 't/md594132.dir'
MANIFEST did not declare 't/md594132.pag'
MANIFEST did not declare 't/md594140.dir'
MANIFEST did not declare 't/md594140.pag'
MANIFEST did not declare 't/md594152.dir'
MANIFEST did not declare 't/md594152.pag'
MANIFEST did not declare 't/md594160.dir'
MANIFEST did not declare 't/md594160.pag'
MANIFEST did not declare 't/md594164.dir'
MANIFEST did not declare 't/md594164.pag'
MANIFEST did not declare 't/md594172.dir'
MANIFEST did not declare 't/md594172.pag'
MANIFEST did not declare 't/md610408.dir'
MANIFEST did not declare 't/md610408.pag'
MANIFEST did not declare 't/md610428.dir'
MANIFEST did not declare 't/md610428.pag'
MANIFEST did not declare 't/md610432.dir'
MANIFEST did not declare 't/md610432.pag'
MANIFEST did not declare 't/md610448.dir'
MANIFEST did not declare 't/md610448.pag'
MANIFEST did not declare 't/md610480.dir'
MANIFEST did not declare 't/md610480.pag'
MANIFEST did not declare 't/md610496.dir'
MANIFEST did not declare 't/md610496.pag'
MANIFEST did not declare 't/md610498.dir'
MANIFEST did not declare 't/md610498.pag'
MANIFEST did not declare 't/md610500.dir'
MANIFEST did not declare 't/md610500.pag'
MANIFEST did not declare 't/md610544.dir'
MANIFEST did not declare 't/md610544.pag'
MANIFEST did not declare 't/md618496.dir'
MANIFEST did not declare 't/md618496.pag'
MANIFEST did not declare 't/md618510.dir'
MANIFEST did not declare 't/md618510.pag'
MANIFEST did not declare 't/md618512.dir'
MANIFEST did not declare 't/md618512.pag'
MANIFEST did not declare 't/md618514.dir'
MANIFEST did not declare 't/md618514.pag'
MANIFEST did not declare 't/md618590.dir'
MANIFEST did not declare 't/md618590.pag'
MANIFEST did not declare 't/md618602.dir'
MANIFEST did not declare 't/md618602.pag'
MANIFEST did not declare 't/md618618.dir'
MANIFEST did not declare 't/md618618.pag'
MANIFEST did not declare 't/md618670.dir'
MANIFEST did not declare 't/md618670.pag'
MANIFEST did not declare 't/md618690.dir'
MANIFEST did not declare 't/md618690.pag'
MANIFEST did not declare 't/md618710.dir'
MANIFEST did not declare 't/md618710.pag'
MANIFEST did not declare 't/md618726.dir'
MANIFEST did not declare 't/md618726.pag'
MANIFEST did not declare 't/md618742.dir'
MANIFEST did not declare 't/md618742.pag'
MANIFEST did not declare 't/md622598.dir'
MANIFEST did not declare 't/md622598.pag'
MANIFEST did not declare 't/md622646.dir'
MANIFEST did not declare 't/md622646.pag'
MANIFEST did not declare 't/md622688.dir'
MANIFEST did not declare 't/md622688.pag'
MANIFEST did not declare 't/md622708.dir'
MANIFEST did not declare 't/md622708.pag'
MANIFEST did not declare 't/md622730.dir'
MANIFEST did not declare 't/md622730.pag'
MANIFEST did not declare 't/md622752.dir'
MANIFEST did not declare 't/md622752.pag'
MANIFEST did not declare 't/md622758.dir'
MANIFEST did not declare 't/md622758.pag'
MANIFEST did not declare 't/md622782.dir'
MANIFEST did not declare 't/md622782.pag'
MANIFEST did not declare 't/md622786.dir'
MANIFEST did not declare 't/md622786.pag'
MANIFEST did not declare 't/md622802.dir'
MANIFEST did not declare 't/md622802.pag'
MANIFEST did not declare 't/md622822.dir'
MANIFEST did not declare 't/md622822.pag'
MANIFEST did not declare 't/md622836.dir'
MANIFEST did not declare 't/md622836.pag'
MANIFEST did not declare 't/md626706.dir'
MANIFEST did not declare 't/md626706.pag'
MANIFEST did not declare 't/md626716.dir'
MANIFEST did not declare 't/md626716.pag'
MANIFEST did not declare 't/md626726.dir'
MANIFEST did not declare 't/md626726.pag'
MANIFEST did not declare 't/md626738.dir'
MANIFEST did not declare 't/md626738.pag'
MANIFEST did not declare 't/md626774.dir'
MANIFEST did not declare 't/md626774.pag'
MANIFEST did not declare 't/md626784.dir'
MANIFEST did not declare 't/md626784.pag'
MANIFEST did not declare 't/md626794.dir'
MANIFEST did not declare 't/md626794.pag'
MANIFEST did not declare 't/md626804.dir'
MANIFEST did not declare 't/md626804.pag'
MANIFEST did not declare 't/md626818.dir'
MANIFEST did not declare 't/md626818.pag'
MANIFEST did not declare 't/md626824.dir'
MANIFEST did not declare 't/md626824.pag'
MANIFEST did not declare 't/md626880.dir'
MANIFEST did not declare 't/md626880.pag'
MANIFEST did not declare 't/md626886.dir'
MANIFEST did not declare 't/md626886.pag'
MANIFEST did not declare 't/md626912.dir'
MANIFEST did not declare 't/md626912.pag'
MANIFEST did not declare 't/md626914.dir'
MANIFEST did not declare 't/md626914.pag'
MANIFEST did not declare 't/md630792.dir'
MANIFEST did not declare 't/md630792.pag'
MANIFEST did not declare 't/md630812.dir'
MANIFEST did not declare 't/md630812.pag'
MANIFEST did not declare 't/md630972.dir'
MANIFEST did not declare 't/md630972.pag'
MANIFEST did not declare 't/md630998.dir'
MANIFEST did not declare 't/md630998.pag'
MANIFEST did not declare 't/md634908.dir'
MANIFEST did not declare 't/md634908.pag'
MANIFEST did not declare 't/md634930.dir'
MANIFEST did not declare 't/md634930.pag'
MANIFEST did not declare 't/md634936.dir'
MANIFEST did not declare 't/md634936.pag'
MANIFEST did not declare 't/md634958.dir'
MANIFEST did not declare 't/md634958.pag'
MANIFEST did not declare 't/md634978.dir'
MANIFEST did not declare 't/md634978.pag'
MANIFEST did not declare 't/md634980.dir'
MANIFEST did not declare 't/md634980.pag'
MANIFEST did not declare 't/md634988.dir'
MANIFEST did not declare 't/md634988.pag'
MANIFEST did not declare 't/md634996.dir'
MANIFEST did not declare 't/md634996.pag'
MANIFEST did not declare 't/md634998.dir'
MANIFEST did not declare 't/md634998.pag'
MANIFEST did not declare 't/md647178.dir'
MANIFEST did not declare 't/md647178.pag'
MANIFEST did not declare 't/md647318.dir'
MANIFEST did not declare 't/md647318.pag'
MANIFEST did not declare 't/md647406.dir'
MANIFEST did not declare 't/md647406.pag'
MANIFEST did not declare 't/md647412.dir'
MANIFEST did not declare 't/md647412.pag'
MANIFEST did not declare 't/md651288.dir'
MANIFEST did not declare 't/md651288.pag'
MANIFEST did not declare 't/md651362.dir'
MANIFEST did not declare 't/md651362.pag'
MANIFEST did not declare 't/md651398.dir'
MANIFEST did not declare 't/md651398.pag'
MANIFEST did not declare 't/md651430.dir'
MANIFEST did not declare 't/md651430.pag'
MANIFEST did not declare 't/md651436.dir'
MANIFEST did not declare 't/md651436.pag'
MANIFEST did not declare 't/md651448.dir'
MANIFEST did not declare 't/md651448.pag'
MANIFEST did not declare 't/md651470.dir'
MANIFEST did not declare 't/md651470.pag'
MANIFEST did not declare 't/md651506.dir'
MANIFEST did not declare 't/md651506.pag'
MANIFEST did not declare 't/md651516.dir'
MANIFEST did not declare 't/md651516.pag'
MANIFEST did not declare 't/md655362.dir'
MANIFEST did not declare 't/md655362.pag'
MANIFEST did not declare 't/md655384.dir'
MANIFEST did not declare 't/md655384.pag'
MANIFEST did not declare 't/md655404.dir'
MANIFEST did not declare 't/md655404.pag'
MANIFEST did not declare 't/md655424.dir'
MANIFEST did not declare 't/md655424.pag'
MANIFEST did not declare 't/md655438.dir'
MANIFEST did not declare 't/md655438.pag'
MANIFEST did not declare 't/md655440.dir'
MANIFEST did not declare 't/md655440.pag'
MANIFEST did not declare 't/md655444.dir'
MANIFEST did not declare 't/md655444.pag'
MANIFEST did not declare 't/md655464.dir'
MANIFEST did not declare 't/md655464.pag'
MANIFEST did not declare 't/md655484.dir'
MANIFEST did not declare 't/md655484.pag'
MANIFEST did not declare 't/md655500.dir'
MANIFEST did not declare 't/md655500.pag'
MANIFEST did not declare 't/md655502.dir'
MANIFEST did not declare 't/md655502.pag'
MANIFEST did not declare 't/md655538.dir'
MANIFEST did not declare 't/md655538.pag'
MANIFEST did not declare 't/md655578.dir'
MANIFEST did not declare 't/md655578.pag'
MANIFEST did not declare 't/md659500.dir'
MANIFEST did not declare 't/md659500.pag'
MANIFEST did not declare 't/md659536.dir'
MANIFEST did not declare 't/md659536.pag'
MANIFEST did not declare 't/md659556.dir'
MANIFEST did not declare 't/md659556.pag'
MANIFEST did not declare 't/md659576.dir'
MANIFEST did not declare 't/md659576.pag'
MANIFEST did not declare 't/md659588.dir'
MANIFEST did not declare 't/md659588.pag'
MANIFEST did not declare 't/md659616.dir'
MANIFEST did not declare 't/md659616.pag'
MANIFEST did not declare 't/md659646.dir'
MANIFEST did not declare 't/md659646.pag'
MANIFEST did not declare 't/md659652.dir'
MANIFEST did not declare 't/md659652.pag'
MANIFEST did not declare 't/md659666.dir'
MANIFEST did not declare 't/md659666.pag'
MANIFEST did not declare 't/md659684.dir'
MANIFEST did not declare 't/md659684.pag'
MANIFEST did not declare 't/md663576.dir'
MANIFEST did not declare 't/md663576.pag'
MANIFEST did not declare 't/md663590.dir'
MANIFEST did not declare 't/md663590.pag'
MANIFEST did not declare 't/md663604.dir'
MANIFEST did not declare 't/md663604.pag'
MANIFEST did not declare 't/md663640.dir'
MANIFEST did not declare 't/md663640.pag'
MANIFEST did not declare 't/md663656.dir'
MANIFEST did not declare 't/md663656.pag'
MANIFEST did not declare 't/md663682.dir'
MANIFEST did not declare 't/md663682.pag'
MANIFEST did not declare 't/md663730.dir'
MANIFEST did not declare 't/md663730.pag'
MANIFEST did not declare 't/md663738.dir'
MANIFEST did not declare 't/md663738.pag'
MANIFEST did not declare 't/md663744.dir'
MANIFEST did not declare 't/md663744.pag'
MANIFEST did not declare 't/md663756.dir'
MANIFEST did not declare 't/md663756.pag'
MANIFEST did not declare 't/md663780.dir'
MANIFEST did not declare 't/md663780.pag'
MANIFEST did not declare 't/md671748.dir'
MANIFEST did not declare 't/md671748.pag'
MANIFEST did not declare 't/md671774.dir'
MANIFEST did not declare 't/md671774.pag'
MANIFEST did not declare 't/md671790.dir'
MANIFEST did not declare 't/md671790.pag'
MANIFEST did not declare 't/md671794.dir'
MANIFEST did not declare 't/md671794.pag'
MANIFEST did not declare 't/md671796.dir'
MANIFEST did not declare 't/md671796.pag'
MANIFEST did not declare 't/md671804.dir'
MANIFEST did not declare 't/md671804.pag'
MANIFEST did not declare 't/md671806.dir'
MANIFEST did not declare 't/md671806.pag'
MANIFEST did not declare 't/md671808.dir'
MANIFEST did not declare 't/md671808.pag'
MANIFEST did not declare 't/md671810.dir'
MANIFEST did not declare 't/md671810.pag'
MANIFEST did not declare 't/md671822.dir'
MANIFEST did not declare 't/md671822.pag'
MANIFEST did not declare 't/md671866.dir'
MANIFEST did not declare 't/md671866.pag'
MANIFEST did not declare 't/md671868.dir'
MANIFEST did not declare 't/md671868.pag'
MANIFEST did not declare 't/md671952.dir'
MANIFEST did not declare 't/md671952.pag'
MANIFEST did not declare 't/md671972.dir'
MANIFEST did not declare 't/md671972.pag'
MANIFEST did not declare 't/md671990.dir'
MANIFEST did not declare 't/md671990.pag'
MANIFEST did not declare 't/md671992.dir'
MANIFEST did not declare 't/md671992.pag'
MANIFEST did not declare 't/md675842.dir'
MANIFEST did not declare 't/md675842.pag'
MANIFEST did not declare 't/md675850.dir'
MANIFEST did not declare 't/md675850.pag'
MANIFEST did not declare 't/md675888.dir'
MANIFEST did not declare 't/md675888.pag'
MANIFEST did not declare 't/md675892.dir'
MANIFEST did not declare 't/md675892.pag'
MANIFEST did not declare 't/md675900.dir'
MANIFEST did not declare 't/md675900.pag'
MANIFEST did not declare 't/md675914.dir'
MANIFEST did not declare 't/md675914.pag'
MANIFEST did not declare 't/md676028.dir'
MANIFEST did not declare 't/md676028.pag'
MANIFEST did not declare 't/md676048.dir'
MANIFEST did not declare 't/md676048.pag'
MANIFEST did not declare 't/md676058.dir'
MANIFEST did not declare 't/md676058.pag'
MANIFEST did not declare 't/md676064.dir'
MANIFEST did not declare 't/md676064.pag'
MANIFEST did not declare 't/md676068.dir'
MANIFEST did not declare 't/md676068.pag'
MANIFEST did not declare 't/md676074.dir'
MANIFEST did not declare 't/md676074.pag'
MANIFEST did not declare 't/md676078.dir'
MANIFEST did not declare 't/md676078.pag'
MANIFEST did not declare 't/md676080.dir'
MANIFEST did not declare 't/md676080.pag'
MANIFEST did not declare 't/md676088.dir'
MANIFEST did not declare 't/md676088.pag'
MANIFEST did not declare 't/md688182.dir'
MANIFEST did not declare 't/md688182.pag'
MANIFEST did not declare 't/md688256.dir'
MANIFEST did not declare 't/md688256.pag'
MANIFEST did not declare 't/md688286.dir'
MANIFEST did not declare 't/md688286.pag'
MANIFEST did not declare 't/md688290.dir'
MANIFEST did not declare 't/md688290.pag'
MANIFEST did not declare 't/md688310.dir'
MANIFEST did not declare 't/md688310.pag'
MANIFEST did not declare 't/md688332.dir'
MANIFEST did not declare 't/md688332.pag'
MANIFEST did not declare 't/md688356.dir'
MANIFEST did not declare 't/md688356.pag'
MANIFEST did not declare 't/md692236.dir'
MANIFEST did not declare 't/md692236.pag'
MANIFEST did not declare 't/md692340.dir'
MANIFEST did not declare 't/md692340.pag'
MANIFEST did not declare 't/md692350.dir'
MANIFEST did not declare 't/md692350.pag'
MANIFEST did not declare 't/md692362.dir'
MANIFEST did not declare 't/md692362.pag'
MANIFEST did not declare 't/md692370.dir'
MANIFEST did not declare 't/md692370.pag'
MANIFEST did not declare 't/md692390.dir'
MANIFEST did not declare 't/md692390.pag'
MANIFEST did not declare 't/md692398.dir'
MANIFEST did not declare 't/md692398.pag'
MANIFEST did not declare 't/md692400.dir'
MANIFEST did not declare 't/md692400.pag'
MANIFEST did not declare 't/md696326.dir'
MANIFEST did not declare 't/md696326.pag'
MANIFEST did not declare 't/md696328.dir'
MANIFEST did not declare 't/md696328.pag'
MANIFEST did not declare 't/md696342.dir'
MANIFEST did not declare 't/md696342.pag'
MANIFEST did not declare 't/md696350.dir'
MANIFEST did not declare 't/md696350.pag'
MANIFEST did not declare 't/md696368.dir'
MANIFEST did not declare 't/md696368.pag'
MANIFEST did not declare 't/md696372.dir'
MANIFEST did not declare 't/md696372.pag'
MANIFEST did not declare 't/md696488.dir'
MANIFEST did not declare 't/md696488.pag'
MANIFEST did not declare 't/md696496.dir'
MANIFEST did not declare 't/md696496.pag'
MANIFEST did not declare 't/md696516.dir'
MANIFEST did not declare 't/md696516.pag'
MANIFEST did not declare 't/md696520.dir'
MANIFEST did not declare 't/md696520.pag'
MANIFEST did not declare 't/md700420.dir'
MANIFEST did not declare 't/md700420.pag'
MANIFEST did not declare 't/md700544.dir'
MANIFEST did not declare 't/md700544.pag'
MANIFEST did not declare 't/md700546.dir'
MANIFEST did not declare 't/md700546.pag'
MANIFEST did not declare 't/md700556.dir'
MANIFEST did not declare 't/md700556.pag'
MANIFEST did not declare 't/md700566.dir'
MANIFEST did not declare 't/md700566.pag'
MANIFEST did not declare 't/md700588.dir'
MANIFEST did not declare 't/md700588.pag'
MANIFEST did not declare 't/md700592.dir'
MANIFEST did not declare 't/md700592.pag'
MANIFEST did not declare 't/md700594.dir'
MANIFEST did not declare 't/md700594.pag'
MANIFEST did not declare 't/md700664.dir'
MANIFEST did not declare 't/md700664.pag'
MANIFEST did not declare 't/md708640.dir'
MANIFEST did not declare 't/md708640.pag'
MANIFEST did not declare 't/md708682.dir'
MANIFEST did not declare 't/md708682.pag'
MANIFEST did not declare 't/md708814.dir'
MANIFEST did not declare 't/md708814.pag'
MANIFEST did not declare 't/md708818.dir'
MANIFEST did not declare 't/md708818.pag'
MANIFEST did not declare 't/md712754.dir'
MANIFEST did not declare 't/md712754.pag'
MANIFEST did not declare 't/md712794.dir'
MANIFEST did not declare 't/md712794.pag'
MANIFEST did not declare 't/md712816.dir'
MANIFEST did not declare 't/md712816.pag'
MANIFEST did not declare 't/md712818.dir'
MANIFEST did not declare 't/md712818.pag'
MANIFEST did not declare 't/md712848.dir'
MANIFEST did not declare 't/md712848.pag'
MANIFEST did not declare 't/md712898.dir'
MANIFEST did not declare 't/md712898.pag'
MANIFEST did not declare 't/md712918.dir'
MANIFEST did not declare 't/md712918.pag'
MANIFEST did not declare 't/tryout.zip'

Compiler messages(aix):
"pp_sys.c", line 3028.22: 1506-280 (W) Function argument assignment between 
types "char*" and "const char*" is not allowed.

-- 
Report by Test::Smoke v1.29_62 build 1186 running on perl 5.8.8
(Reporter v0.033 / Smoker v0.039)


<Prev in Thread] Current Thread [Next in Thread>