perl.daily-build.reports
[Top] [All Lists]

Smoke [5.11.0] 34170 FAIL(X) HP-UX B.11.11/64 (PA-RISC2.0/1 cpu)

Subject: Smoke [5.11.0] 34170 FAILX) HP-UX B.11.11/64 (PA-RISC2.0/1 cpu
From: Abe Timmerman
Date: Tue, 5 Aug 2008 02:39 +0100
Newsgroups: perl.daily-build.reports

Automated smoke report for 5.11.0 patch 34170
hector: PA8500 (PA-RISC2.0/1 cpu)
    on        HP-UX - B.11.11/64
    using     gcc version 3.4.6
    smoketime 14 hours 54 minutes (average 3 hours 43 minutes)

Summary: FAIL(X)

O = OK  F = Failure(s), extended report at the bottom
X = Failure(s) under TEST but not under harness
? = still running or test results not (yet) available
Build failures during:       - = unknown or N/A
c = Configure, m = make, M = make (after miniperl), t = make test-prep

   34170     Configuration (common) -Dcc=gcc
----------- ---------------------------------------------------------
O O X O O X 
X X X X X X -Duseithreads
| | | | | +- LC_ALL = univ.utf8 -DDEBUGGING
| | | | +--- PERLIO = perlio -DDEBUGGING
| | | +----- PERLIO = stdio  -DDEBUGGING
| | +------- LC_ALL = univ.utf8
| +--------- PERLIO = perlio
+----------- PERLIO = stdio 

Locally applied patches:
    DEVEL
    SMOKE34170

Failures: (common-args) -Dcc=gcc
[univ.utf8] 
[univ.utf8] -DDEBUGGING
Inconsistent test results (between TEST and harness):
    ../lib/Pod/t/man-options.t..............FAILED at test 3

[stdio/perlio] -Duseithreads
[stdio/perlio] -DDEBUGGING -Duseithreads
Inconsistent test results (between TEST and harness):
    ../ext/threads/shared/t/stress.t........FAILED at test 1

[univ.utf8] -Duseithreads
[univ.utf8] -DDEBUGGING -Duseithreads
Inconsistent test results (between TEST and harness):
    ../ext/threads/shared/t/stress.t........FAILED at test 1
    ../lib/Pod/t/man-options.t..............FAILED at test 3

Compiler messages(gcc):
pp_sys.c: In function `Perl_pp_gpwent':
pp_sys.c:5168: warning: implicit declaration of function `getspnam_r'

-- 
Report by Test::Smoke v1.32 build 1178 running on perl 5.8.5
(Reporter v0.033 / Smoker v0.039)


<Prev in Thread] Current Thread [Next in Thread>
  • Smoke [5.11.0] 34170 FAIL(X) HP-UX B.11.11/64 (PA-RISC2.0/1 cpu), Abe Timmerman <=