perl.daily-build.reports
[Top] [All Lists]

Smoke [5.11.0] 34016 FAIL(F) HP-UX B.11.11/64 (PA-RISC2.0/1 cpu)

Subject: Smoke [5.11.0] 34016 FAILF) HP-UX B.11.11/64 (PA-RISC2.0/1 cpu
From: Abe Timmerman
Date: Sun, 8 Jun 2008 19:51 +0100
Newsgroups: perl.daily-build.reports

Automated smoke report for 5.11.0 patch 34016
hector: PA8500 (PA-RISC2.0/1 cpu)
    on        HP-UX - B.11.11/64
    using     gcc version 3.4.6
    smoketime 14 hours 52 minutes (average 3 hours 43 minutes)

Summary: FAIL(F)

O = OK  F = Failure(s), extended report at the bottom
X = Failure(s) under TEST but not under harness
? = still running or test results not (yet) available
Build failures during:       - = unknown or N/A
c = Configure, m = make, M = make (after miniperl), t = make test-prep

   34016     Configuration (common) -Dcc=gcc
----------- ---------------------------------------------------------
F F F F F F 
F F F F F F -Duseithreads
| | | | | +- LC_ALL = univ.utf8 -DDEBUGGING
| | | | +--- PERLIO = perlio -DDEBUGGING
| | | +----- PERLIO = stdio  -DDEBUGGING
| | +------- LC_ALL = univ.utf8
| +--------- PERLIO = perlio
+----------- PERLIO = stdio 

Locally applied patches:
    DEVEL
    SMOKE34016

Failures: (common-args) -Dcc=gcc
[stdio/perlio] 
[stdio/perlio] -DDEBUGGING
    ../ext/Sys/Syslog/t/syslog.t................................FAILED
        27, 29, 31-32, 93, 95, 97-98, 137, 139
        141-142

[univ.utf8] 
[univ.utf8] -DDEBUGGING
    ../ext/Sys/Syslog/t/syslog.t................................FAILED
        27, 29, 31-32, 93, 95, 97-98, 137, 139
        141-142
    ../lib/Pod/t/man-options.t..................................FAILED
        2

[stdio/perlio] -Duseithreads
[stdio/perlio] -DDEBUGGING -Duseithreads
    ../ext/Sys/Syslog/t/syslog.t................................FAILED
        27, 29, 31-32, 93, 95, 97-98, 137, 139
        141-142
    ../ext/threads/shared/t/stress.t............................FAILED
        1

[univ.utf8] -Duseithreads
[univ.utf8] -DDEBUGGING -Duseithreads
    ../ext/Sys/Syslog/t/syslog.t................................FAILED
        27, 29, 31-32, 93, 95, 97-98, 137, 139
        141-142
    ../ext/threads/shared/t/stress.t............................FAILED
        1
    ../lib/Pod/t/man-options.t..................................FAILED
        2

Compiler messages(gcc):
pp_sys.c: In function `Perl_pp_gpwent':
pp_sys.c:5165: warning: implicit declaration of function `getspnam_r'

-- 
Report by Test::Smoke v1.32 build 1178 running on perl 5.8.5
(Reporter v0.033 / Smoker v0.039)


<Prev in Thread] Current Thread [Next in Thread>
  • Smoke [5.11.0] 34016 FAIL(F) HP-UX B.11.11/64 (PA-RISC2.0/1 cpu), Abe Timmerman <=