perl.daily-build.reports
[Top] [All Lists]

Smoke [5.11.0] 33788 FAIL(F) linux 2.6.17-10-powerpc [debian] (ppc/1 cpu

Subject: Smoke [5.11.0] 33788 FAILF) linux 2.6.17-10-powerpc [debian] (ppc/1 cpu
From: Abe Timmerman
Date: Wed, 7 May 2008 14:16 +0200
Newsgroups: perl.daily-build.reports

Automated smoke report for 5.11.0 patch 33788
bobby: 7400, altivec supported PowerMac G4 (400.000000MHz) (ppc/1 cpu)
    on        linux - 2.6.17-10-powerpc [debian]
    using     cc version 4.1.2 20060928 (prerelease) (Ubuntu 4.1.1-13ubuntu5)
    smoketime 1 day 14 hours 41 minutes (average 2 hours 25 minutes)

Summary: FAIL(F)

O = OK  F = Failure(s), extended report at the bottom
X = Failure(s) under TEST but not under harness
? = still running or test results not (yet) available
Build failures during:       - = unknown or N/A
c = Configure, m = make, M = make (after miniperl), t = make test-prep

   33788     Configuration (common) none
----------- ---------------------------------------------------------
F O O F O O 
F O O F O O -Duse64bitint
F O O F O O -Duselongdouble
F O O F O O -Dusemorebits
F O O F O O -Duseithreads
F O O F O O -Duseithreads -Duse64bitint
F O O F O O -Duseithreads -Duselongdouble
F O O F O O -Duseithreads -Dusemorebits
| | | | | +- LC_ALL = en_US.utf8 -DDEBUGGING
| | | | +--- PERLIO = perlio -DDEBUGGING
| | | +----- PERLIO = stdio  -DDEBUGGING
| | +------- LC_ALL = en_US.utf8
| +--------- PERLIO = perlio
+----------- PERLIO = stdio 

Locally applied patches:
    DEVEL
    SMOKE33788

Failures: (common-args) none
[stdio] 
[stdio] -DDEBUGGING
[stdio] -Duse64bitint
[stdio] -DDEBUGGING -Duse64bitint
[stdio] -Duselongdouble
[stdio] -DDEBUGGING -Duselongdouble
[stdio] -Dusemorebits
[stdio] -DDEBUGGING -Dusemorebits
    ../ext/Compress/Zlib/t/14gzopen.t...........................FAILED
        Bad plan.  You planned 250 tests but ran 138.
    ../ext/IO_Compress_Zlib/t/100generic-deflate.t..............FAILED
        Bad plan.  You planned 670 tests but ran 81.
    ../ext/IO_Compress_Zlib/t/100generic-gzip.t.................FAILED
        Bad plan.  You planned 670 tests but ran 81.
    ../ext/IO_Compress_Zlib/t/100generic-rawdeflate.t...........FAILED
        Bad plan.  You planned 670 tests but ran 81.
    ../ext/IO_Compress_Zlib/t/100generic-zip.t..................FAILED
        Bad plan.  You planned 670 tests but ran 81.
    ../ext/IO_Compress_Zlib/t/105oneshot-deflate.t..............FAILED
        Bad plan.  You planned 970 tests but ran 173.
    ../ext/IO_Compress_Zlib/t/105oneshot-gzip.t.................FAILED
        Bad plan.  You planned 970 tests but ran 173.
    ../ext/IO_Compress_Zlib/t/105oneshot-rawdeflate.t...........FAILED
        Bad plan.  You planned 970 tests but ran 173.
    ../ext/IO_Compress_Zlib/t/105oneshot-zip.t..................FAILED
        Bad plan.  You planned 970 tests but ran 173.
    ../lib/Archive/Extract/t/01_Archive-Extract.t...............FAILED
    ../lib/CPANPLUS/Dist/Build/t/02_CPANPLUS-Dist-Build.t.......FAILED
    ../lib/CPANPLUS/t/20_CPANPLUS-Dist-MM.t.....................FAILED
    ../lib/IPC/Cmd/t/01_IPC-Cmd.t...............................FAILED
    ../t/io/dup.t...............................................FAILED
        Bad plan.  You planned 29 tests but ran 14.
    ../t/io/open.t..............................................FAILED
        93

[stdio] -Duseithreads
[stdio] -DDEBUGGING -Duseithreads
[stdio] -Duseithreads -Duse64bitint
[stdio] -DDEBUGGING -Duseithreads -Duse64bitint
[stdio] -Duseithreads -Duselongdouble
[stdio] -DDEBUGGING -Duseithreads -Duselongdouble
[stdio] -Duseithreads -Dusemorebits
[stdio] -DDEBUGGING -Duseithreads -Dusemorebits
    ../ext/Compress/Zlib/t/14gzopen.t...........................FAILED
        Bad plan.  You planned 250 tests but ran 138.
    ../ext/Hash/Util/FieldHash/t/03_class.t.....................FAILED
        Bad plan.  You planned 7 tests but ran 2.
    ../ext/Hash/Util/FieldHash/t/04_thread.t....................FAILED
        Bad plan.  You planned 30 tests but ran 6.
    ../ext/IO_Compress_Zlib/t/100generic-deflate.t..............FAILED
        Bad plan.  You planned 670 tests but ran 81.
    ../ext/IO_Compress_Zlib/t/100generic-gzip.t.................FAILED
        Bad plan.  You planned 670 tests but ran 81.
    ../ext/IO_Compress_Zlib/t/100generic-rawdeflate.t...........FAILED
        Bad plan.  You planned 670 tests but ran 81.
    ../ext/IO_Compress_Zlib/t/100generic-zip.t..................FAILED
        Bad plan.  You planned 670 tests but ran 81.
    ../ext/IO_Compress_Zlib/t/105oneshot-deflate.t..............FAILED
        Bad plan.  You planned 970 tests but ran 173.
    ../ext/IO_Compress_Zlib/t/105oneshot-gzip.t.................FAILED
        Bad plan.  You planned 970 tests but ran 173.
    ../ext/IO_Compress_Zlib/t/105oneshot-rawdeflate.t...........FAILED
        Bad plan.  You planned 970 tests but ran 173.
    ../ext/IO_Compress_Zlib/t/105oneshot-zip.t..................FAILED
        Bad plan.  You planned 970 tests but ran 173.
    ../ext/Storable/t/threads.t.................................FAILED
        Bad plan.  You planned 2 tests but ran 0.
    ../ext/XS/APItest/t/my_cxt.t................................FAILED
        Bad plan.  You planned 16 tests but ran 7.
    ../ext/threads/shared/t/av_refs.t...........................FAILED
        Bad plan.  You planned 14 tests but ran 3.
    ../ext/threads/shared/t/av_simple.t.........................FAILED
        Bad plan.  You planned 44 tests but ran 9.
    ../ext/threads/shared/t/blessed.t...........................FAILED
        Bad plan.  You planned 37 tests but ran 1.
    ../ext/threads/shared/t/cond.t..............................FAILED
        Bad plan.  You planned 32 tests but ran 2.
    ../ext/threads/shared/t/hv_refs.t...........................FAILED
        Bad plan.  You planned 20 tests but ran 3.
    ../ext/threads/shared/t/hv_simple.t.........................FAILED
        Bad plan.  You planned 16 tests but ran 2.
    ../ext/threads/shared/t/no_share.t..........................FAILED
        Bad plan.  You planned 6 tests but ran 3.
    ../ext/threads/shared/t/object.t............................FAILED
        Bad plan.  You planned 28 tests but ran 5.
    ../ext/threads/shared/t/shared_attr.t.......................FAILED
        Bad plan.  You planned 101 tests but ran 2.
    ../ext/threads/shared/t/stress.t............................FAILED
        Bad plan.  You planned 1 tests but ran 0.
    ../ext/threads/shared/t/sv_refs.t...........................FAILED
        Bad plan.  You planned 11 tests but ran 6.
    ../ext/threads/shared/t/sv_simple.t.........................FAILED
        Bad plan.  You planned 11 tests but ran 3.
    ../ext/threads/shared/t/wait.t..............................FAILED
        7-48, 50-91
    ../ext/threads/shared/t/waithires.t.........................FAILED
        3-29, 31-57
    ../ext/threads/t/basic.t....................................FAILED
        Bad plan.  You planned 33 tests but ran 2.
    ../ext/threads/t/blocks.t...................................FAILED
        Bad plan.  You planned 5 tests but ran 0.
    ../ext/threads/t/context.t..................................FAILED
        Bad plan.  You planned 31 tests but ran 1.
    ../ext/threads/t/end.t......................................FAILED
        Bad plan.  You planned 6 tests but ran 1.
    ../ext/threads/t/err.t......................................FAILED
        Bad plan.  You planned 10 tests but ran 1.
    ../ext/threads/t/exit.t.....................................FAILED
        Bad plan.  You planned 18 tests but ran 1.
    ../ext/threads/t/free.t.....................................FAILED
        Bad plan.  You planned 29 tests but ran 1.
    ../ext/threads/t/free2.t....................................FAILED
        Bad plan.  You planned 78 tests but ran 1.
    ../ext/threads/t/join.t.....................................FAILED
        Bad plan.  You planned 20 tests but ran 1.
    ../ext/threads/t/kill.t.....................................FAILED
        No plan found in TAP output
    ../ext/threads/t/libc.t.....................................FAILED
        Bad plan.  You planned 11 tests but ran 1.
    ../ext/threads/t/list.t.....................................FAILED
        Bad plan.  You planned 15 tests but ran 2.
    ../ext/threads/t/problems.t.................................FAILED
        Bad plan.  You planned 15 tests but ran 1.
    ../ext/threads/t/stack.t....................................FAILED
        Bad plan.  You planned 18 tests but ran 4.
    ../ext/threads/t/state.t....................................FAILED
        Bad plan.  You planned 59 tests but ran 1.
    ../ext/threads/t/stress_cv.t................................FAILED
        Bad plan.  You planned 61 tests but ran 1.
    ../ext/threads/t/stress_re.t................................FAILED
        Bad plan.  You planned 61 tests but ran 1.
    ../ext/threads/t/stress_string.t............................FAILED
        Bad plan.  You planned 61 tests but ran 1.
    ../ext/threads/t/thread.t...................................FAILED
        Bad plan.  You planned 34 tests but ran 1.
    ../lib/Archive/Extract/t/01_Archive-Extract.t...............FAILED
    ../lib/CPANPLUS/Dist/Build/t/02_CPANPLUS-Dist-Build.t.......FAILED
    ../lib/CPANPLUS/t/20_CPANPLUS-Dist-MM.t.....................FAILED
    ../lib/IPC/Cmd/t/01_IPC-Cmd.t...............................FAILED
    ../lib/Test/Simple/t/threads.t..............................FAILED
        Bad plan.  You planned 6 tests but ran 0.
    ../lib/Thread.t.............................................FAILED
        Bad plan.  You planned 13 tests but ran 0.
    ../lib/Thread/Queue/t/01_basic.t............................FAILED
        Bad plan.  You planned 81 tests but ran 2.
    ../lib/Thread/Queue/t/02_refs.t.............................FAILED
        Bad plan.  You planned 39 tests but ran 5.
    ../lib/Thread/Queue/t/03_peek.t.............................FAILED
        Bad plan.  You planned 19 tests but ran 1.
    ../lib/Thread/Queue/t/05_extract.t..........................FAILED
        Bad plan.  You planned 20 tests but ran 1.
    ../lib/Thread/Queue/t/06_insert.t...........................FAILED
        Bad plan.  You planned 16 tests but ran 1.
    ../lib/Thread/Queue/t/07_lock.t.............................FAILED
        Bad plan.  You planned 3 tests but ran 1.
    ../lib/Thread/Semaphore/t/01_basic.t........................FAILED
        Bad plan.  You planned 10 tests but ran 2.
    ../t/io/dup.t...............................................FAILED
        Bad plan.  You planned 29 tests but ran 14.
    ../t/io/open.t..............................................FAILED
        93
    ../t/op/getpid.t............................................FAILED
        Bad plan.  You planned 3 tests but ran 1.
    ../t/op/index_thr.t.........................................FAILED
        Bad plan.  You planned 69 tests but ran 0.
    ../t/op/pat_thr.t...........................................FAILED
        Bad plan.  You planned 4035 tests but ran 0.
    ../t/op/reg_email_thr.t.....................................FAILED
        Bad plan.  You planned 13 tests but ran 0.
    ../t/op/regexp_qr_embed_thr.t...............................FAILED
        Bad plan.  You planned 1347 tests but ran 3.
    ../t/op/reset.t.............................................FAILED
        21-24
    ../t/op/substr_thr.t........................................FAILED
        Bad plan.  You planned 334 tests but ran 0.
    ../t/op/threads.t...........................................FAILED
        1-3
        Bad plan.  You planned 13 tests but ran 3.

Compiler messages(gcc):
dump.c: In function âPerl_sv_peekâ:
dump.c:526: warning: format â%gâ expects type âdoubleâ, but argument 3 has type 
âNVâ
dump.c: In function âPerl_do_sv_dumpâ:
dump.c:1598: warning: format â%.*gâ expects type âdoubleâ, but argument 5 has 
type âNVâ
dump.c:1736: warning: format â%.1fâ expects type âdoubleâ, but argument 4 has 
type âNVâ
util.c: In function âPerl_upg_versionâ:
util.c:4556: warning: format â%.9fâ expects type âdoubleâ, but argument 4 has 
type âNVâ
sv.c: In function âPerl_sv_incâ:
sv.c:6995: warning: format â%fâ expects type âdoubleâ, but argument 3 has type 
âNVâ
sv.c: In function âPerl_sv_decâ:
sv.c:7161: warning: format â%fâ expects type âdoubleâ, but argument 3 has type 
âNVâ
pp.c: In function âPerl_pp_sinâ:
pp.c:2811: warning: initialization from incompatible pointer type
pp.c:2817: warning: assignment from incompatible pointer type
pp.c:2821: warning: assignment from incompatible pointer type
pp.c:2825: warning: assignment from incompatible pointer type
pp.c:2830: warning: assignment from incompatible pointer type
pp.c:2841: warning: format â%gâ expects type âdoubleâ, but argument 3 has type 
âNVâ
pp_pack.c: In function âS_unpack_recâ:
pp_pack.c:2203: warning: passing argument 2 of âmodfâ from incompatible pointer 
type
POSIX.xs: In function âXS_POSIX_modfâ:
POSIX.xs:1232: warning: passing argument 2 of âmodfâ from incompatible pointer 
type
sv.c: In function âS_sv_2iuv_commonâ:
sv.c:2019: warning: format â%gâ expects type âdoubleâ, but argument 4 has type 
âNVâ
sv.c:2030: warning: format â%gâ expects type âdoubleâ, but argument 4 has type 
âNVâ
sv.c:2147: warning: format â%gâ expects type âdoubleâ, but argument 4 has type 
âNVâ
sv.c: In function âPerl_sv_2nvâ:
sv.c:2477: warning: format â%gâ expects type âdoubleâ, but argument 4 has type 
âNVâ
sv.c:2620: warning: format â%gâ expects type âdoubleâ, but argument 4 has type 
âNVâ
sv.c:7043: warning: format â%gâ expects type âdoubleâ, but argument 5 has type 
âNVâ
sv.c:7203: warning: format â%gâ expects type âdoubleâ, but argument 5 has type 
âNVâ
sv.c:2200: warning: format â%gâ expects type âdoubleâ, but argument 2 has type 
âNVâ
sv.c: In function âS_sv_2iuv_non_preserveâ:
sv.c:1930: warning: format â%gâ expects type âdoubleâ, but argument 5 has type 
âNVâ
dump.c:526: warning: format â%gâ expects type âdoubleâ, but argument 4 has type 
âNVâ
dump.c:1598: warning: format â%.*gâ expects type âdoubleâ, but argument 6 has 
type âNVâ
dump.c:1736: warning: format â%.1fâ expects type âdoubleâ, but argument 5 has 
type âNVâ
sv.c:6995: warning: format â%fâ expects type âdoubleâ, but argument 4 has type 
âNVâ
sv.c:7161: warning: format â%fâ expects type âdoubleâ, but argument 4 has type 
âNVâ
pp.c:2841: warning: format â%gâ expects type âdoubleâ, but argument 4 has type 
âNVâ
sv.c:2200: warning: format â%gâ expects type âdoubleâ, but argument 3 has type 
âNVâ

-- 
Report by Test::Smoke v1.32 build 1178 running on perl 5.8.8
(Reporter v0.033 / Smoker v0.039)


<Prev in Thread] Current Thread [Next in Thread>
  • Smoke [5.11.0] 33788 FAIL(F) linux 2.6.17-10-powerpc [debian] (ppc/1 cpu), Abe Timmerman <=