perl.daily-build.reports
[Top] [All Lists]

Smoke [5.10.0] 33007 FAIL(F) netbsd 3.1 (i386/1 cpu)

Subject: Smoke [5.10.0] 33007 FAILF) netbsd 3.1 (i386/1 cpu
From: Abe Timmerman
Date: Sat, 19 Jan 2008 17:02 +0100
Newsgroups: perl.daily-build.reports

Automated smoke report for 5.10.0 patch 33007
wodan.test-smoke.org: Intel Pentium III (686-class) (i386/1 cpu)
    on        netbsd - 3.1
    using     cc version 3.3.3 (NetBSD nb3 20040520)
    smoketime 8 hours 11 minutes (average 1 hour 1 minute)

Summary: FAIL(F)

O = OK  F = Failure(s), extended report at the bottom
X = Failure(s) under TEST but not under harness
? = still running or test results not (yet) available
Build failures during:       - = unknown or N/A
c = Configure, m = make, M = make (after miniperl), t = make test-prep

   33007     Configuration (common) none
----------- ---------------------------------------------------------
F F F F     
F F F F     -Duse64bitint
F F F F     -Duseithreads
F F F F     -Duseithreads -Duse64bitint
| | | +----- PERLIO = perlio -DDEBUGGING
| | +------- PERLIO = stdio  -DDEBUGGING
| +--------- PERLIO = perlio
+----------- PERLIO = stdio


Locally applied patches:
    MAINT
    SMOKE33007

Failures: (common-args) none
[stdio/perlio] 
[stdio/perlio] -DDEBUGGING
[stdio/perlio] -Duse64bitint
[stdio/perlio] -DDEBUGGING -Duse64bitint
[perlio] -DDEBUGGING -Duseithreads
[stdio] -DDEBUGGING -Duseithreads -Duse64bitint
    ../lib/CPANPLUS/t/20_CPANPLUS-Dist-MM.t.FAILED ??
    ../lib/IPC/Cmd/t/01_IPC-Cmd.t...........FAILED ??
    ../t/io/dup.t...........................FAILED 15-16
    ../t/io/open.t..........................FAILED 93
Inconsistent test results (between TEST and harness):
    ../lib/CPANPLUS/Dist/Build/t/02_CPANPLUS-Dist-Build.tFAILED--non-zero wait 
status: 65280
    ../lib/Archive/Extract/t/01_Archive-Extract.tFAILED--non-zero wait status: 
65280

[stdio] -Duseithreads
    ../lib/CPANPLUS/t/20_CPANPLUS-Dist-MM.t.FAILED ??
    ../lib/IPC/Cmd/t/01_IPC-Cmd.t...........FAILED ??
    ../t/io/dup.t...........................FAILED 15-16
    ../t/io/open.t..........................FAILED 93
    ../t/op/threads.t.......................FAILED 10
Inconsistent test results (between TEST and harness):
    ../lib/Benchmark.t......................FAILED at test 126
    ../lib/CPANPLUS/Dist/Build/t/02_CPANPLUS-Dist-Build.tFAILED--non-zero wait 
status: 65280
    ../lib/Archive/Extract/t/01_Archive-Extract.tFAILED--non-zero wait status: 
65280

[perlio] -Duseithreads
[stdio] -DDEBUGGING -Duseithreads
[stdio/perlio] -Duseithreads -Duse64bitint
    ../lib/CPANPLUS/t/20_CPANPLUS-Dist-MM.t.FAILED ??
    ../lib/IPC/Cmd/t/01_IPC-Cmd.t...........FAILED ??
    ../t/io/dup.t...........................FAILED 15-16
    ../t/io/open.t..........................FAILED 93
    ../t/op/threads.t.......................FAILED 10
Inconsistent test results (between TEST and harness):
    ../lib/CPANPLUS/Dist/Build/t/02_CPANPLUS-Dist-Build.tFAILED--non-zero wait 
status: 65280
    ../lib/Archive/Extract/t/01_Archive-Extract.tFAILED--non-zero wait status: 
65280

[perlio] -DDEBUGGING -Duseithreads -Duse64bitint
    ../lib/CPANPLUS/t/20_CPANPLUS-Dist-MM.t.FAILED ??
    ../lib/IPC/Cmd/t/01_IPC-Cmd.t...........FAILED ??
    ../t/io/dup.t...........................FAILED 15-16
    ../t/io/open.t..........................FAILED 93
    ../t/op/threads.t.......................FAILED 10
Inconsistent test results (between TEST and harness):
    ../ext/threads/t/stress_string.t........FAILED--expected 61 tests, saw 14
    ../lib/CPANPLUS/Dist/Build/t/02_CPANPLUS-Dist-Build.tFAILED--non-zero wait 
status: 65280
    ../lib/Archive/Extract/t/01_Archive-Extract.tFAILED--non-zero wait status: 
65280

Compiler messages(gcc):
<command line>:12:1: warning: "TIME_HIRES_STAT" redefined
<command line>:11:1: warning: this is the location of the previous definition
<command line>:14:1: warning: "TIME_HIRES_STAT" redefined
<command line>:13:1: warning: this is the location of the previous definition

-- 
Report by Test::Smoke v1.29_61 build 1169 running on perl 5.8.8
(Reporter v0.033 / Smoker v0.038)


<Prev in Thread] Current Thread [Next in Thread>
  • Smoke [5.10.0] 33007 FAIL(F) netbsd 3.1 (i386/1 cpu), Abe Timmerman <=