perl.daily-build.reports
[Top] [All Lists]

Smoke [5.11.0] 32749 FAIL(X) Solaris 2.10 (i386/1 cpu)

Subject: Smoke [5.11.0] 32749 FAILX) Solaris 2.10 (i386/1 cpu
From: Abe Timmerman
Date: Sat, 29 Dec 2007 10:57 +0100
Newsgroups: perl.daily-build.reports

Automated smoke report for 5.11.0 patch 32749
ayla: i86pc (350MHz) (i386/1 cpu)
    on        Solaris - 2.10
    using     /opt/SUNWspro/bin/cc version Sun C 5.8 2005/10/13
    smoketime 1 day 5 hours 54 minutes (average 3 hours 44 minutes)

Summary: FAIL(X)

O = OK  F = Failure(s), extended report at the bottom
X = Failure(s) under TEST but not under harness
? = still running or test results not (yet) available
Build failures during:       - = unknown or N/A
c = Configure, m = make, M = make (after miniperl), t = make test-prep

   32749     Configuration (common) none
----------- ---------------------------------------------------------
O O O O O O 
O O O O O O -Dusemorebits
X X X X O X -Duseithreads
O X O X X X -Duseithreads -Dusemorebits
| | | | | +- LC_ALL = nl_NL.UTF-8 -DDEBUGGING
| | | | +--- PERLIO = stdio -DDEBUGGING
| | | +----- PERLIO = perlio -DDEBUGGING
| | +------- LC_ALL = nl_NL.UTF-8
| +--------- PERLIO = perlio
+----------- PERLIO = stdio
Locally applied patches:
    DEVEL
    SMOKE32749

Failures: (common-args) none
[stdio/perlio] -Duseithreads
[stdio] -DDEBUGGING -Duseithreads
[perlio] -Duseithreads -Dusemorebits
[stdio/perlio] -DDEBUGGING -Duseithreads -Dusemorebits
Inconsistent test results (between TEST and harness):
    ../ext/threads/shared/t/stress.t........FAILED at test 1

[nl_NL.UTF-8] -Duseithreads
[nl_NL.UTF-8] -DDEBUGGING -Duseithreads
Inconsistent test results (between TEST and harness):
    ../ext/threads/shared/t/waithires.t.....FAILED at test 7

[nl_NL.UTF-8] -DDEBUGGING -Duseithreads -Dusemorebits
Inconsistent test results (between TEST and harness):
    ../ext/threads/shared/t/stress.t........FAILED at test 1
    ../ext/threads/shared/t/waithires.t.....FAILED at test 7

-- 
Report by Test::Smoke v1.20.07 build 1123 running on perl 5.8.4
(Reporter v0.029 / Smoker v0.036)


<Prev in Thread] Current Thread [Next in Thread>
  • Smoke [5.11.0] 32749 FAIL(X) Solaris 2.10 (i386/1 cpu), Abe Timmerman <=