perl.daily-build.reports
[Top] [All Lists]

Smoke [5.8.8] 32471 FAIL(F) netbsd 3.1 (i386/1 cpu)

Subject: Smoke [5.8.8] 32471 FAILF) netbsd 3.1 (i386/1 cpu
From: Abe Timmerman
Date: Sat, 24 Nov 2007 06:44 +0100
Newsgroups: perl.daily-build.reports

Automated smoke report for 5.8.8 patch 32471
wodan.test-smoke.org: Intel Pentium III (686-class) (i386/1 cpu)
    on        netbsd - 3.1
    using     cc version 3.3.3 (NetBSD nb3 20040520)
    smoketime 5 hours 22 minutes (average 32 minutes 12 seconds)

Summary: FAIL(F)

O = OK  F = Failure(s), extended report at the bottom
X = Failure(s) under TEST but not under harness
? = still running or test results not (yet) available
Build failures during:       - = unknown or N/A
c = Configure, m = make, M = make (after miniperl), t = make test-prep

   32471     Configuration (common) none
----------- ---------------------------------------------------------
F - F -     -Uuseperlio
F F F F     
F F F F     -Duse64bitint
F F F F     -Duseithreads
F F F F     -Duseithreads -Duse64bitint
| | | +----- PERLIO = perlio -DDEBUGGING
| | +------- PERLIO = stdio  -DDEBUGGING
| +--------- PERLIO = perlio
+----------- PERLIO = stdio

Locally applied patches:
    MAINT32328
    SMOKE32471

Failures: (common-args) none
[stdio] -Uuseperlio
[stdio] -DDEBUGGING -Uuseperlio
    ../t/io/open.t..........................FAILED 93

[stdio/perlio] 
[stdio/perlio] -DDEBUGGING
[stdio/perlio] -Duse64bitint
[stdio/perlio] -DDEBUGGING -Duse64bitint
[stdio] -Duseithreads
[stdio/perlio] -DDEBUGGING -Duseithreads
[stdio] -Duseithreads -Duse64bitint
[stdio/perlio] -DDEBUGGING -Duseithreads -Duse64bitint
    ../t/io/dup.t...........................FAILED 15-16
    ../t/io/open.t..........................FAILED 93

[perlio] -Duseithreads
    ../t/io/dup.t...........................FAILED 15-16
    ../t/io/open.t..........................FAILED 93
Inconsistent test results (between TEST and harness):
    ../lib/Benchmark.t......................FAILED at test 126

[perlio] -Duseithreads -Duse64bitint
    ../t/io/dup.t...........................FAILED 15-16
    ../t/io/open.t..........................FAILED 93
Inconsistent test results (between TEST and harness):
    ../ext/threads/shared/t/stress.t........FAILED--expected 1 tests, saw 0

Compiler messages(gcc):
pad.c: In function `Perl_pad_add_name':
pad.c:361: warning: value computed is not used
regcomp.c: In function `S_study_chunk':
regcomp.c:683: warning: comparison between signed and unsigned
regcomp.c:1037: warning: comparison between signed and unsigned
regcomp.c:1037: warning: signed and unsigned type in conditional expression
regcomp.c:1581: warning: comparison between signed and unsigned
regcomp.c:1636: warning: comparison between signed and unsigned
regcomp.c: In function `Perl_pregcomp':
regcomp.c:1835: warning: comparison between signed and unsigned
regcomp.c:1835: warning: signed and unsigned type in conditional expression
dump.c: In function `Perl_sv_peek':
dump.c:480: warning: signed and unsigned type in conditional expression
dump.c: In function `Perl_do_sv_dump':
dump.c:1302: warning: signed and unsigned type in conditional expression
mg.c: In function `Perl_magic_setenv':
mg.c:1138: warning: unused variable `path_sep'
sv.c: In function `Perl_sv_force_normal_flags':
sv.c:3757: warning: signed and unsigned type in conditional expression
sv.c: In function `Perl_sv_clear':
sv.c:4681: warning: signed and unsigned type in conditional expression
pp_ctl.c: In function `Perl_pp_formline':
pp_ctl.c:780: warning: signed and unsigned type in conditional expression
doio.c: In function `Perl_my_stat':
doio.c:1263: warning: `gv' might be used uninitialized in this function
doio.c: In function `Perl_do_shmio':
doio.c:2255: warning: comparison between signed and unsigned
doio.c:2255: warning: signed and unsigned type in conditional expression
regexec.c: In function `S_regcppop':
regexec.c:247: warning: comparison between signed and unsigned
perlio.c: In function `PerlIO_apply_layers':
perlio.c:247: warning: unused parameter `f'
perlio.c:247: warning: unused parameter `mode'
perlio.c: In function `PerlIO_binmode':
perlio.c:269: warning: unused parameter `names'
perlio.c: In function `PerlIO_fdupopen':
perlio.c:282: warning: unused parameter `param'
perlio.c:282: warning: unused parameter `flags'
perlio.c: In function `PerlIO_openn':
perlio.c:323: warning: unused parameter `layers'
numeric.c: In function `Perl_grok_numeric_radix':
numeric.c:504: warning: signed and unsigned type in conditional expression
numeric.c: In function `Perl_my_atof':
numeric.c:809: warning: signed and unsigned type in conditional expression
mathoms.c: In function `S_vdie_common':
mathoms.c:1276: warning: unused parameter `message'
mathoms.c:1276: warning: unused parameter `msglen'
mathoms.c:1276: warning: unused parameter `utf8'
<command line>:12:1: warning: "TIME_HIRES_STAT" redefined
<command line>:11:1: warning: this is the location of the previous definition
sv.c: In function `Perl_sv_2nv':
sv.c:2308: warning: signed and unsigned type in conditional expression
sv.c:2433: warning: signed and unsigned type in conditional expression
regexec.c:229: warning: comparison between signed and unsigned
<command line>:14:1: warning: "TIME_HIRES_STAT" redefined
<command line>:13:1: warning: this is the location of the previous definition
sv.c:4680: warning: signed and unsigned type in conditional expression
re.xs:50: warning: initialization from incompatible pointer type
re.xs: In function `install':
re.xs:90: warning: assignment from incompatible pointer type

-- 
Report by Test::Smoke v1.20.07 build 1123 running on perl 5.8.8
(Reporter v0.029 / Smoker v0.036)


<Prev in Thread] Current Thread [Next in Thread>
  • Smoke [5.8.8] 32471 FAIL(F) netbsd 3.1 (i386/1 cpu), Abe Timmerman <=