perl.daily-build.reports
[Top] [All Lists]

Smoke [5.8.8] 32409 FAIL(F) linux 2.6.15-27-powerpc [debian] (ppc/1 cpu)

Subject: Smoke [5.8.8] 32409 FAILF) linux 2.6.15-27-powerpc [debian] (ppc/1 cpu
From: Abe Timmerman
Date: Tue, 20 Nov 2007 22:32 +0100
Newsgroups: perl.daily-build.reports

Automated smoke report for 5.8.8 patch 32409
bobby: 7400, altivec supported PowerMac G4 (400.000000MHz) (ppc/1 cpu)
    on        linux - 2.6.15-27-powerpc [debian]
    using     cc version 4.1.2 20060928 (prerelease) (Ubuntu 4.1.1-13ubuntu5)
    smoketime 22 hours 43 minutes (average 1 hour 15 minutes)

Summary: FAIL(F)

O = OK  F = Failure(s), extended report at the bottom
X = Failure(s) under TEST but not under harness
? = still running or test results not (yet) available
Build failures during:       - = unknown or N/A
c = Configure, m = make, M = make (after miniperl), t = make test-prep

   32409     Configuration (common) none
----------- ---------------------------------------------------------
F - - F - - -Uuseperlio
F O O F O O 
F O O F O O -Duse64bitint
F O O F O O -Duselongdouble
F O O F O O -Dusemorebits
F O O F O O -Duseithreads
F O O F O O -Duseithreads -Duse64bitint
F O O F O O -Duseithreads -Duselongdouble
F O O F O O -Duseithreads -Dusemorebits
| | | | | +- LC_ALL = en_US.utf8 -DDEBUGGING
| | | | +--- PERLIO = stdio -DDEBUGGING
| | | +----- PERLIO = perlio -DDEBUGGING
| | +------- LC_ALL = en_US.utf8
| +--------- PERLIO = perlio
+----------- PERLIO = stdio
Locally applied patches:
    MAINT32328
    SMOKE32409

Failures: (common-args) none
[stdio] -Uuseperlio
[stdio] -DDEBUGGING -Uuseperlio
    ../t/io/open.t..........................FAILED 93

[stdio] 
[stdio] -DDEBUGGING
[stdio] -Duse64bitint
[stdio] -DDEBUGGING -Duse64bitint
[stdio] -Duselongdouble
[stdio] -DDEBUGGING -Duselongdouble
[stdio] -Dusemorebits
[stdio] -DDEBUGGING -Dusemorebits
    ../t/io/dup.t...........................FAILED 15-29
    ../t/io/open.t..........................FAILED 93

[stdio] -Duseithreads
[stdio] -DDEBUGGING -Duseithreads
[stdio] -Duseithreads -Duse64bitint
[stdio] -DDEBUGGING -Duseithreads -Duse64bitint
[stdio] -Duseithreads -Duselongdouble
[stdio] -DDEBUGGING -Duseithreads -Duselongdouble
[stdio] -Duseithreads -Dusemorebits
[stdio] -DDEBUGGING -Duseithreads -Dusemorebits
    ../ext/Storable/t/threads.t.............FAILED 1-2
    ../ext/XS/APItest/t/my_cxt.t............FAILED 6-11
    ../ext/threads/shared/t/av_refs.t.......FAILED 4-14
    ../ext/threads/shared/t/av_simple.t.....FAILED 10-44
    ../ext/threads/shared/t/blessed.t.......FAILED 2-37
    ../ext/threads/shared/t/cond.t..........FAILED 3-32
    ../ext/threads/shared/t/hv_refs.t.......FAILED 4-20
    ../ext/threads/shared/t/hv_simple.t.....FAILED 3-16
    ../ext/threads/shared/t/no_share.t......FAILED 4-6
    ../ext/threads/shared/t/shared_attr.t...FAILED 3-101
    ../ext/threads/shared/t/stress.t........FAILED 1
    ../ext/threads/shared/t/sv_refs.t.......FAILED 7-11
    ../ext/threads/shared/t/sv_simple.t.....FAILED 4-11
    ../ext/threads/shared/t/wait.t..........FAILED 7-48 50-91
    ../ext/threads/shared/t/waithires.t.....FAILED 3-29 31-57
    ../ext/threads/t/basic.t................FAILED 3-33
    ../ext/threads/t/blocks.t...............FAILED 1-5
    ../ext/threads/t/context.t..............FAILED 2-31
    ../ext/threads/t/end.t..................FAILED 2-6
    ../ext/threads/t/err.t..................FAILED 2-10
    ../ext/threads/t/exit.t.................FAILED 2-18
    ../ext/threads/t/free.t.................FAILED 2-29
    ../ext/threads/t/free2.t................FAILED 2-78
    ../ext/threads/t/join.t.................FAILED 2-20
    ../ext/threads/t/kill.t.................FAILED ??
    ../ext/threads/t/libc.t.................FAILED 2-11
    ../ext/threads/t/list.t.................FAILED 3-15
    ../ext/threads/t/problems.t.............FAILED 2-15
    ../ext/threads/t/stack.t................FAILED 5-18
    ../ext/threads/t/state.t................FAILED 2-59
    ../ext/threads/t/stress_cv.t............FAILED 2-61
    ../ext/threads/t/stress_re.t............FAILED 2-61
    ../ext/threads/t/stress_string.t........FAILED 2-61
    ../ext/threads/t/thread.t...............FAILED 2-34
    ../lib/Test/Simple/t/threads.t..........FAILED 1-6
    ../lib/Thread/Queue.t...................FAILED 1-26
    ../t/io/dup.t...........................FAILED 15-29
    ../t/io/open.t..........................FAILED 93
    ../t/op/getpid.t........................FAILED 2-3
    ../t/op/threads.t.......................FAILED 1-10
Inconsistent test results (between TEST and harness):
    ../lib/Test/Simple/t/is_deeply_with_threads.tFAILED--expected 505 tests, 
saw 0

Compiler messages(gcc):
op.c: In function âPerl_fold_constantsâ:
op.c:2114: warning: argument âoâ might be clobbered by âlongjmpâ or âvforkâ
mg.c: In function âPerl_magic_setenvâ:
mg.c:1138: warning: unused variable âpath_sepâ
pp_hot.c: In function âPerl_pp_sassignâ:
pp_hot.c:144: warning: value computed is not used
sv.c: In function âPerl_sv_2pv_flagsâ:
sv.c:2610: warning: value computed is not used
sv.c: In function âPerl_sv_force_normal_flagsâ:
sv.c:3756: warning: signed and unsigned type in conditional expression
sv.c: In function âPerl_sv_clearâ:
sv.c:4680: warning: signed and unsigned type in conditional expression
sv.c: In function âPerl_sv_len_utf8â:
sv.c:4848: warning: comparison is always false due to limited range of data type
sv.c: In function âS_sv_pos_u2b_cachedâ:
sv.c:5004: warning: comparison is always false due to limited range of data type
sv.c:5009: warning: comparison is always false due to limited range of data type
sv.c: In function âS_utf8_mg_pos_cache_updateâ:
sv.c:5128: warning: comparison is always false due to limited range of data type
sv.c: In function âPerl_sv_pos_b2uâ:
sv.c:5351: warning: comparison is always false due to limited range of data type
sv.c:5354: warning: comparison is always false due to limited range of data type
pp.c: In function âPerl_pp_ucfirstâ:
pp.c:3532: warning: value computed is not used
pp.c: In function âPerl_pp_ucâ:
pp.c:3630: warning: value computed is not used
pp.c: In function âPerl_pp_lcâ:
pp.c:3729: warning: value computed is not used
pp_ctl.c: In function âS_run_user_filterâ:
pp_ctl.c:4005: warning: value computed is not used
doio.c: In function âPerl_do_shmioâ:
doio.c:2255: warning: comparison between signed and unsigned
doio.c:2255: warning: signed and unsigned type in conditional expression
doio.c: In function âPerl_my_statâ:
doio.c:1263: warning: âgvâ may be used uninitialized in this function
regexec.c: In function âS_regcppopâ:
regexec.c:247: warning: comparison between signed and unsigned
perlio.c: In function âPerlIO_apply_layersâ:
perlio.c:247: warning: unused parameter âfâ
perlio.c:247: warning: unused parameter âmodeâ
perlio.c: In function âPerlIO_binmodeâ:
perlio.c:269: warning: unused parameter ânamesâ
perlio.c: In function âPerlIO_fdupopenâ:
perlio.c:282: warning: unused parameter âparamâ
perlio.c:282: warning: unused parameter âflagsâ
perlio.c: In function âPerlIO_opennâ:
perlio.c:323: warning: unused parameter âlayersâ
mathoms.c: In function âS_vdie_commonâ:
mathoms.c:1276: warning: unused parameter âmessageâ
mathoms.c:1276: warning: unused parameter âmsglenâ
mathoms.c:1276: warning: unused parameter âutf8â
opmini.c: In function âPerl_fold_constantsâ:
opmini.c:2114: warning: argument âoâ might be clobbered by âlongjmpâ or âvforkâ
regexec.c:229: warning: comparison between signed and unsigned
pp.c: In function âPerl_pp_sinâ:
pp.c:2806: warning: initialization from incompatible pointer type
pp.c:2812: warning: assignment from incompatible pointer type
pp.c:2816: warning: assignment from incompatible pointer type
pp.c:2820: warning: assignment from incompatible pointer type
pp.c:2825: warning: assignment from incompatible pointer type
pp_pack.c: In function âS_unpack_recâ:
pp_pack.c:2278: warning: passing argument 2 of âmodfâ from incompatible pointer 
type
POSIX.xs: In function âXS_POSIX_modfâ:
POSIX.xs:1232: warning: passing argument 2 of âmodfâ from incompatible pointer 
type
sv.c:4679: warning: signed and unsigned type in conditional expression
perlio.c: In function âPerlIO_cloneâ:
perlio.c:682: warning: ignoring return value of âPerl_fp_dupâ, declared with 
attribute warn_unused_result
re.xs:50: warning: initialization from incompatible pointer type
re.xs: In function âinstallâ:
re.xs:90: warning: assignment from incompatible pointer type

-- 
Report by Test::Smoke v1.20.07 build 1123 running on perl 5.8.8
(Reporter v0.029 / Smoker v0.036)


<Prev in Thread] Current Thread [Next in Thread>
  • Smoke [5.8.8] 32409 FAIL(F) linux 2.6.15-27-powerpc [debian] (ppc/1 cpu), Abe Timmerman <=