perl.daily-build.reports
[Top] [All Lists]

Smoke [5.10.0] 32209 FAIL(X) HP-UX B.10.20 (PA-RISC2.0/32/1 cpu)

Subject: Smoke [5.10.0] 32209 FAILX) HP-UX B.10.20 (PA-RISC2.0/32/1 cpu
From: H.Merijn Brand
Date: Sat, 3 Nov 2007 12:57 +0100
Newsgroups: perl.daily-build.reports

Automated smoke report for 5.10.0 patch 32209
d3: PA8000 (PA-RISC2.0/32/1 cpu)
    on        HP-UX - B.10.20
    using     gcc version 3.4.6
    smoketime 19 hours 22 minutes (average 4 hours 50 minutes)

Summary: FAIL(X)

O = OK  F = Failure(s), extended report at the bottom
X = Failure(s) under TEST but not under harness
? = still running or test results not (yet) available
Build failures during:       - = unknown or N/A
c = Configure, m = make, M = make (after miniperl), t = make test-prep

   32209     Configuration (common) -Dcc=gcc
----------- ---------------------------------------------------------
O O O O O O 
O O O X O O -Duseithreads
| | | | | +- LC_ALL = univ.utf8 -DDEBUGGING
| | | | +--- PERLIO = stdio -DDEBUGGING
| | | +----- PERLIO = perlio -DDEBUGGING
| | +------- LC_ALL = univ.utf8
| +--------- PERLIO = perlio
+----------- PERLIO = stdio
Locally applied patches:
    DEVEL
    SMOKE32209

Failures: (common-args) -Dcc=gcc
[stdio] -DDEBUGGING -Duseithreads
Inconsistent test results (between TEST and harness):
    ../lib/Memoize/t/speed.t................FAILED at test 2

MANIFEST did not declare 'a.out'
MANIFEST did not declare 'lib/CPANPLUS/t/dummy-CPAN/packages.txt'
MANIFEST did not declare 'patchlevel.bak'

Compiler messages(gcc):
toke.c: In function `Perl_yylex':
toke.c:3809: warning: null argument where non-null required (arg 1)
try.c: In function `main':
try.c:53: error: request for member `fds_bits' in something not a structure or 
union
try.c:56: warning: passing arg 2 of `select' from incompatible pointer type
try.c:57: error: request for member `fds_bits' in something not a structure or 
union
miniperlmain.c: In function `main':
miniperlmain.c:98: warning: implicit declaration of function `pthread_atfork'
toke.c:3809: warning: null argument where non-null required (arg 2)
perl.c: In function `perl_fini':
perl.c:1416: warning: implicit declaration of function `pthread_key_delete'
pp_sys.c: In function `Perl_pp_send':
pp_sys.c:1972: warning: passing arg 2 of `cma_send' discards qualifiers from 
pointer target type
pp_sys.c: In function `Perl_pp_gmtime':
pp_sys.c:4459: warning: implicit declaration of function `localtime_r'
pp_sys.c:4462: warning: implicit declaration of function `gmtime_r'
perlmain.c: In function `main':
perlmain.c:98: warning: implicit declaration of function `pthread_atfork'

-- 
Report by Test::Smoke v1.20.07 build 1123 running on perl 5.8.8
(Reporter v0.029 / Smoker v0.036)


<Prev in Thread] Current Thread [Next in Thread>
  • Smoke [5.10.0] 32209 FAIL(X) HP-UX B.10.20 (PA-RISC2.0/32/1 cpu), H.Merijn Brand <=