perl.daily-build.reports
[Top] [All Lists]

Smoke [5.10.0] 32216 PASS HP-UX B.10.20 (PA-RISC2.0/32/1 cpu)

Subject: Smoke [5.10.0] 32216 PASS HP-UX B.10.20 PA-RISC2.0/32/1 cpu
From: H.Merijn Brand
Date: Sun, 4 Nov 2007 17:35 +0100
Newsgroups: perl.daily-build.reports

Automated smoke report for 5.10.0 patch 32216
d3: PA8000 (PA-RISC2.0/32/1 cpu)
    on        HP-UX - B.10.20
    using     cc version A.10.32.30
    smoketime 18 hours 14 minutes (average 4 hours 33 minutes)

Summary: PASS

O = OK  F = Failure(s), extended report at the bottom
X = Failure(s) under TEST but not under harness
? = still running or test results not (yet) available
Build failures during:       - = unknown or N/A
c = Configure, m = make, M = make (after miniperl), t = make test-prep

   32216     Configuration (common) none
----------- ---------------------------------------------------------
O O O O O O 
O O O O O O -Duseithreads
| | | | | +- LC_ALL = univ.utf8 -DDEBUGGING
| | | | +--- PERLIO = stdio -DDEBUGGING
| | | +----- PERLIO = perlio -DDEBUGGING
| | +------- LC_ALL = univ.utf8
| +--------- PERLIO = perlio
+----------- PERLIO = stdio
Locally applied patches:
    DEVEL
    SMOKE32216

Compiler messages(hpux):
cc: "re_comp.c", line 8685: warning 562: Redeclaration of "S_regdump_extflags" 
with a different storage class specifier: "S_regdump_extflags" will have 
internal linkage.
cc: "regcomp.c", line 8685: warning 562: Redeclaration of "S_regdump_extflags" 
with a different storage class specifier: "S_regdump_extflags" will have 
internal linkage.
cc: "try.c", line 53: error 1529: Cannot select field of non-structure.
cc: "try.c", line 53: error 1549: Modifiable lvalue required for assignment 
operator.
cc: "try.c", line 56: warning 604: Pointers are not assignment-compatible.
cc: "try.c", line 56: warning 563: Argument #2 is not the correct type.
cc: "try.c", line 57: error 1529: Cannot select field of non-structure.
cc: "try.c", line 57: error 1566: Test expression in for must be scalar.
cc: "pp_sys.c", line 1972: warning 611: Qualifiers are not 
assignment-compatible.
cc: "pp_sys.c", line 1972: warning 563: Argument #2 is not the correct type.

-- 
Report by Test::Smoke v1.20.07 build 1123 running on perl 5.8.8
(Reporter v0.029 / Smoker v0.036)


<Prev in Thread] Current Thread [Next in Thread>