perl.daily-build.reports
[Top] [All Lists]

Smoke [5.10.0] 32199 FAIL(X) linux 2.6.22.9-61.fc6 [fedora] (i686/2 cpu)

Subject: Smoke [5.10.0] 32199 FAILX) linux 2.6.22.9-61.fc6 [fedora] (i686/2 cpu
From:
Date: Sun, 28 Oct 2007 08:33 +0100
Newsgroups: perl.daily-build.reports

Automated smoke report for 5.10.0 patch 32199
phoenix.squirrel.nl: Intel(R) Core(TM)2 CPU 6300 @ 1.86GHz (GenuineIntel 
1596MHz) (i686/2 cpu)
    on        linux - 2.6.22.9-61.fc6 [fedora]
    using     cc version 4.1.2 20070626 (Red Hat 4.1.2-13)
    smoketime 8 hours 30 minutes (average 31 minutes 53 seconds)

Summary: FAIL(X)

O = OK  F = Failure(s), extended report at the bottom
X = Failure(s) under TEST but not under harness
? = still running or test results not (yet) available
Build failures during:       - = unknown or N/A
c = Configure, m = make, M = make (after miniperl), t = make test-prep

   32199     Configuration (common) none
----------- ---------------------------------------------------------
O O O X X X 
X X X X X X -Duse64bitint
X X X X X X -Duselongdouble
O O O O O O -Dusemorebits
O O O O O O -Duseithreads
O O O O O O -Duseithreads -Duse64bitint
O O O O O O -Duseithreads -Duselongdouble
O O O O O O -Duseithreads -Dusemorebits
| | | | | +- LC_ALL = nl_NL.utf8 -DDEBUGGING
| | | | +--- PERLIO = perlio -DDEBUGGING
| | | +----- PERLIO = stdio  -DDEBUGGING
| | +------- LC_ALL = nl_NL.utf8
| +--------- PERLIO = perlio
+----------- PERLIO = stdio

Locally applied patches:
    DEVEL
    SMOKE32199

Failures: (common-args) none
[stdio/perlio/nl_NL.utf8] -DDEBUGGING
[stdio/perlio/nl_NL.utf8] -Duse64bitint
Inconsistent test results (between TEST and harness):
    ../ext/IO_Compress_Zlib/t/105oneshot-zip-only.tFAILED at test 46

[stdio/perlio/nl_NL.utf8] -DDEBUGGING -Duse64bitint
Inconsistent test results (between TEST and harness):
    ../ext/IO_Compress_Zlib/t/105oneshot-zip-only.tFAILED at test 35

[stdio/perlio/nl_NL.utf8] -Duselongdouble
[stdio/perlio/nl_NL.utf8] -DDEBUGGING -Duselongdouble
Inconsistent test results (between TEST and harness):
    ../ext/IO_Compress_Zlib/t/105oneshot-zip-only.tFAILED at test 13

-- 
Report by Test::Smoke v1.19_86 build 1044 running on perl 5.8.8
(Reporter v0.027 / Smoker v0.032)


<Prev in Thread] Current Thread [Next in Thread>
  • Smoke [5.10.0] 32199 FAIL(X) linux 2.6.22.9-61.fc6 [fedora] (i686/2 cpu), jvromans <=