perl.daily-build.reports
[Top] [All Lists]

Smoke [5.9.5] 31454 FAIL(F) Solaris 2.10 (i386/1 cpu)

Subject: Smoke [5.9.5] 31454 FAILF) Solaris 2.10 (i386/1 cpu
From: Abe Timmerman
Date: Mon, 25 Jun 2007 19:32 +0200
Newsgroups: perl.daily-build.reports

Automated smoke report for 5.9.5 patch 31454
ayla: i86pc (350MHz) (i386/1 cpu)
    on        Solaris - 2.10
    using     /opt/SUNWspro/bin/cc version Sun C 5.8 2005/10/13
    smoketime 1 day 3 hours 48 minutes (average 3 hours 28 minutes)

Summary: FAIL(F)

O = OK  F = Failure(s), extended report at the bottom
X = Failure(s) under TEST but not under harness
? = still running or test results not (yet) available
Build failures during:       - = unknown or N/A
c = Configure, m = make, M = make (after miniperl), t = make test-prep

   31454     Configuration (common) none
----------- ---------------------------------------------------------
F F F F F F 
F F F F F F -Dusemorebits
F F F F F F -Duseithreads
F F F F F F -Duseithreads -Dusemorebits
| | | | | +- LC_ALL = nl_NL.UTF-8 -DDEBUGGING
| | | | +--- PERLIO = perlio -DDEBUGGING
| | | +----- PERLIO = stdio  -DDEBUGGING
| | +------- LC_ALL = nl_NL.UTF-8
| +--------- PERLIO = perlio
+----------- PERLIO = stdio

Locally applied patches:
    DEVEL
    SMOKE31454

Failures: (common-args) none
[stdio/perlio/nl_NL.UTF-8] 
[stdio/perlio/nl_NL.UTF-8] -DDEBUGGING
[stdio/perlio/nl_NL.UTF-8] -Dusemorebits
[stdio/perlio/nl_NL.UTF-8] -DDEBUGGING -Dusemorebits
[stdio/perlio] -Duseithreads
[stdio/perlio] -DDEBUGGING -Duseithreads
[perlio] -Duseithreads -Dusemorebits
[stdio/perlio] -DDEBUGGING -Duseithreads -Dusemorebits
    ../t/op/utftaint.t......................FAILED 87-88

[nl_NL.UTF-8] -Duseithreads
[nl_NL.UTF-8] -DDEBUGGING -Duseithreads
[nl_NL.UTF-8] -DDEBUGGING -Duseithreads -Dusemorebits
    ../ext/threads/shared/t/waithires.t.....FAILED 7
    ../t/op/utftaint.t......................FAILED 87-88

[stdio] -Duseithreads -Dusemorebits
    ../t/op/utftaint.t......................FAILED 87-88
Inconsistent test results (between TEST and harness):
    ../ext/threads/shared/t/stress.t........FAILED at test 1

[nl_NL.UTF-8] -Duseithreads -Dusemorebits
    ../t/op/utftaint.t......................FAILED 87-88
Inconsistent test results (between TEST and harness):
    ../ext/threads/shared/t/waithires.t.....FAILED at test 7

-- 
Report by Test::Smoke v1.19_86 build 1044 running on perl 5.8.4
(Reporter v0.027 / Smoker v0.032)


<Prev in Thread] Current Thread [Next in Thread>
  • Smoke [5.9.5] 31454 FAIL(F) Solaris 2.10 (i386/1 cpu), Abe Timmerman <=