perl.daily-build.reports
[Top] [All Lists]

Smoke [5.9.5] 31369 FAIL(X) linux 2.6.18.8-0.3-default [SuSE] (i686/1 cp

Subject: Smoke [5.9.5] 31369 FAILX) linux 2.6.18.8-0.3-default [SuSE] (i686/1 cpu
From: H.Merijn Brand
Date: Wed, 13 Jun 2007 15:58 +0200
Newsgroups: perl.daily-build.reports

Automated smoke report for 5.9.5 patch 31369
pc09: Intel(R) Pentium(R) 4 CPU 1.70GHz (GenuineIntel 1695MHz) (i686/1 cpu)
    on        linux - 2.6.18.8-0.3-default [SuSE]
    using     ccache gcc version 4.0.2
    smoketime 17 hours 38 minutes (average 1 hour 6 minutes)

Summary: FAIL(X)

O = OK  F = Failure(s), extended report at the bottom
X = Failure(s) under TEST but not under harness
? = still running or test results not (yet) available
Build failures during:       - = unknown or N/A
c = Configure, m = make, M = make (after miniperl), t = make test-prep

   31369     Configuration (common) none
----------- ---------------------------------------------------------
O O O O O O 
O O O X O O -Duse64bitint
O O O O O O -Duselongdouble
O O O O O O -Dusemorebits
O O O O O X -Duseithreads
O X O O O O -Duseithreads -Duse64bitint
O O O O O X -Duseithreads -Duselongdouble
O O O O O O -Duseithreads -Dusemorebits
| | | | | +- LC_ALL = en_US.utf8 -DDEBUGGING
| | | | +--- PERLIO = perlio -DDEBUGGING
| | | +----- PERLIO = stdio  -DDEBUGGING
| | +------- LC_ALL = en_US.utf8
| +--------- PERLIO = perlio
+----------- PERLIO = stdio

Locally applied patches:
    DEVEL
    SMOKE31369

Failures: (common-args) none
[stdio] -DDEBUGGING -Duse64bitint
Inconsistent test results (between TEST and harness):
    ../ext/Time/HiRes/t/HiRes.t.............FAILED at test 17

[en_US.utf8] -DDEBUGGING -Duseithreads
Inconsistent test results (between TEST and harness):
    ../ext/Time/HiRes/t/HiRes.t.............FAILED at test 36

[perlio] -Duseithreads -Duse64bitint
Inconsistent test results (between TEST and harness):
    ../t/op/alarm.t.........................FAILED at test 2

[en_US.utf8] -DDEBUGGING -Duseithreads -Duselongdouble
Inconsistent test results (between TEST and harness):
    ../ext/threads/shared/t/waithires.t.....FAILED--expected test 15, saw test 
17

MANIFEST did not declare 'merijn/Configure'

Compiler messages(gcc):
proto.h:3644: warning: 'S_emulate_eaccess' declared 'static' but never defined
op.c: In function 'Perl_fold_constants':
op.c:2332: warning: variable 'curop' might be clobbered by 'longjmp' or 'vfork'
opmini.c: In function 'Perl_fold_constants':
opmini.c:2332: warning: variable 'curop' might be clobbered by 'longjmp' or 
'vfork'
regcomp.c: In function 'Perl_regprop':
regcomp.c:8828: warning: format '%LX' expects type 'long long unsigned int', 
but argument 3 has type 'U32'
regcomp.c:8828: warning: format '%LX' expects type 'long long unsigned int', 
but argument 4 has type 'U32'

-- 
Report by Test::Smoke v1.19_87 build 1048 running on perl 5.8.8
(Reporter v0.027 / Smoker v0.032)


<Prev in Thread] Current Thread [Next in Thread>
  • Smoke [5.9.5] 31369 FAIL(X) linux 2.6.18.8-0.3-default [SuSE] (i686/1 cpu), H.Merijn Brand <=