perl.daily-build.reports
[Top] [All Lists]

Smoke [5.9.5] 31466 FAIL(F) linux 2.6.15-27-powerpc [debian] (ppc/1 cpu)

Subject: Smoke [5.9.5] 31466 FAILF) linux 2.6.15-27-powerpc [debian] (ppc/1 cpu
From: Abe Timmerman
Date: Tue, 26 Jun 2007 15:37 +0200
Newsgroups: perl.daily-build.reports

Automated smoke report for 5.9.5 patch 31466
bobby: 7400, altivec supported PowerMac G4 (400.000000MHz) (ppc/1 cpu)
    on        linux - 2.6.15-27-powerpc [debian]
    using     cc version 4.1.2 20060928 (prerelease) (Ubuntu 4.1.1-13ubuntu5)
    smoketime 16 hours 12 minutes (average 2 hours 1 minute)

Summary: FAIL(F)

O = OK  F = Failure(s), extended report at the bottom
X = Failure(s) under TEST but not under harness
? = still running or test results not (yet) available
Build failures during:       - = unknown or N/A
c = Configure, m = make, M = make (after miniperl), t = make test-prep

   31466     Configuration (common) none
----------- ---------------------------------------------------------
F F F F F F 
F F F F F F -Duse64bitint
F F F F F F -Duseithreads
F F F F F F -Duseithreads -Duse64bitint
| | | | | +- LC_ALL = en_US.utf8 -DDEBUGGING
| | | | +--- PERLIO = perlio -DDEBUGGING
| | | +----- PERLIO = stdio  -DDEBUGGING
| | +------- LC_ALL = en_US.utf8
| +--------- PERLIO = perlio
+----------- PERLIO = stdio

Locally applied patches:
    DEVEL
    SMOKE31466

Failures: (common-args) none
[stdio] 
    ../ext/Compress/Zlib/t/14gzopen.t.......FAILED 139-217
    ../t/io/dup.t...........................FAILED 15-29
    ../t/io/open.t..........................FAILED 93
    ../t/op/utftaint.t......................FAILED 87-88
Inconsistent test results (between TEST and harness):
    ../ext/IO_Compress_Zlib/t/100generic-gzip.tFAILED--expected 641 tests, saw 
81
    ../ext/IO_Compress_Zlib/t/105oneshot-deflate.tFAILED--expected 970 tests, 
saw 173
    ../ext/IO_Compress_Zlib/t/105oneshot-gzip.tFAILED--expected 970 tests, saw 
173
    ../ext/IO_Compress_Zlib/t/105oneshot-rawdeflate.tFAILED--expected 970 
tests, saw 173
    ../ext/IO_Compress_Zlib/t/100generic-zip.tFAILED--expected 641 tests, saw 81
    ../ext/IO_Compress_Zlib/t/105oneshot-zip.tFAILED--expected 970 tests, saw 
173
    ../ext/IO_Compress_Zlib/t/100generic-rawdeflate.tFAILED--expected 641 
tests, saw 81
    ../ext/IO_Compress_Zlib/t/100generic-deflate.tFAILED--expected 641 tests, 
saw 81

[perlio/en_US.utf8] 
[perlio/en_US.utf8] -DDEBUGGING
[perlio/en_US.utf8] -Duse64bitint
[perlio/en_US.utf8] -DDEBUGGING -Duse64bitint
[perlio/en_US.utf8] -Duseithreads
[perlio/en_US.utf8] -DDEBUGGING -Duseithreads
[perlio/en_US.utf8] -Duseithreads -Duse64bitint
[perlio/en_US.utf8] -DDEBUGGING -Duseithreads -Duse64bitint
    ../t/op/utftaint.t......................FAILED 87-88

[stdio] -DDEBUGGING
[stdio] -Duse64bitint
[stdio] -DDEBUGGING -Duse64bitint
    ../ext/Compress/Zlib/t/14gzopen.t.......FAILED 139-217
    ../t/io/dup.t...........................FAILED 15-29
    ../t/io/open.t..........................FAILED 93
    ../t/op/utftaint.t......................FAILED 87-88
Inconsistent test results (between TEST and harness):
    ../ext/IO_Compress_Zlib/t/100generic-gzip.tFAILED--expected 641 tests, saw 
81
    ../ext/IO_Compress_Zlib/t/105oneshot-deflate.tFAILED--expected 970 tests, 
saw 173
    ../ext/IO_Compress_Zlib/t/105oneshot-gzip.tFAILED--expected 970 tests, saw 
173
    ../ext/IO_Compress_Zlib/t/100generic-zip.tFAILED--expected 641 tests, saw 81
    ../ext/IO_Compress_Zlib/t/105oneshot-rawdeflate.tFAILED--expected 970 
tests, saw 173
    ../ext/IO_Compress_Zlib/t/105oneshot-zip.tFAILED--expected 970 tests, saw 
173
    ../ext/IO_Compress_Zlib/t/100generic-rawdeflate.tFAILED--expected 641 
tests, saw 81
    ../ext/IO_Compress_Zlib/t/100generic-deflate.tFAILED--expected 641 tests, 
saw 81

[stdio] -Duseithreads
[stdio] -DDEBUGGING -Duseithreads
[stdio] -Duseithreads -Duse64bitint
[stdio] -DDEBUGGING -Duseithreads -Duse64bitint
    ../ext/Compress/Zlib/t/14gzopen.t.......FAILED 139-217
    ../ext/Hash/Util/FieldHash/t/03_class.t.FAILED 3-7
    ../ext/Hash/Util/FieldHash/t/04_thread.tFAILED 7-30
    ../ext/Storable/t/threads.t.............FAILED 1-2
    ../ext/XS/APItest/t/my_cxt.t............FAILED 6-11
    ../ext/threads/shared/t/av_refs.t.......FAILED 4-14
    ../ext/threads/shared/t/av_simple.t.....FAILED 10-44
    ../ext/threads/shared/t/blessed.t.......FAILED 2-37
    ../ext/threads/shared/t/cond.t..........FAILED 3-32
    ../ext/threads/shared/t/hv_refs.t.......FAILED 4-20
    ../ext/threads/shared/t/hv_simple.t.....FAILED 3-16
    ../ext/threads/shared/t/no_share.t......FAILED 4-6
    ../ext/threads/shared/t/shared_attr.t...FAILED 3-101
    ../ext/threads/shared/t/stress.t........FAILED 1
    ../ext/threads/shared/t/sv_refs.t.......FAILED 7-11
    ../ext/threads/shared/t/sv_simple.t.....FAILED 4-11
    ../ext/threads/shared/t/wait.t..........FAILED 7-48 50-91
    ../ext/threads/shared/t/waithires.t.....FAILED 3-29 31-57
    ../ext/threads/t/basic.t................FAILED 3-33
    ../ext/threads/t/blocks.t...............FAILED 1-5
    ../ext/threads/t/context.t..............FAILED 2-31
    ../ext/threads/t/end.t..................FAILED 2-6
    ../ext/threads/t/err.t..................FAILED 2-10
    ../ext/threads/t/exit.t.................FAILED 2-18
    ../ext/threads/t/free.t.................FAILED 2-29
    ../ext/threads/t/free2.t................FAILED 2-78
    ../ext/threads/t/join.t.................FAILED 2-20
    ../ext/threads/t/kill.t.................FAILED ??
    ../ext/threads/t/libc.t.................FAILED 2-11
    ../ext/threads/t/list.t.................FAILED 3-15
    ../ext/threads/t/problems.t.............FAILED 2-15
    ../ext/threads/t/stack.t................FAILED 5-18
    ../ext/threads/t/state.t................FAILED 2-59
    ../ext/threads/t/stress_cv.t............FAILED 3-63
    ../ext/threads/t/stress_re.t............FAILED 2-31
    ../ext/threads/t/stress_string.t........FAILED 3-63
    ../ext/threads/t/thread.t...............FAILED 2-31
    ../lib/Test/Simple/t/sort_bug.t.........FAILED 1-2
    ../lib/Test/Simple/t/threads.t..........FAILED 1-6
    ../lib/Thread.t.........................FAILED 1-13
    ../lib/Thread/Queue.t...................FAILED 1-26
    ../t/io/dup.t...........................FAILED 15-29
    ../t/io/open.t..........................FAILED 93
    ../t/op/getpid.t........................FAILED 2-3
    ../t/op/reset.t.........................FAILED 21-24
    ../t/op/threads.t.......................FAILED 1-6
    ../t/op/utftaint.t......................FAILED 87-88
Inconsistent test results (between TEST and harness):
    ../ext/IO_Compress_Zlib/t/105oneshot-zip.tFAILED--expected 970 tests, saw 
173
    ../ext/IO_Compress_Zlib/t/100generic-deflate.tFAILED--expected 641 tests, 
saw 81
    ../ext/IO_Compress_Zlib/t/100generic-rawdeflate.tFAILED--expected 641 
tests, saw 81
    ../ext/IO_Compress_Zlib/t/105oneshot-gzip.tFAILED--expected 970 tests, saw 
173
    ../ext/IO_Compress_Zlib/t/105oneshot-rawdeflate.tFAILED--expected 970 
tests, saw 173
    ../ext/IO_Compress_Zlib/t/100generic-gzip.tFAILED--expected 641 tests, saw 
81
    ../ext/IO_Compress_Zlib/t/105oneshot-deflate.tFAILED--expected 970 tests, 
saw 173
    ../ext/IO_Compress_Zlib/t/100generic-zip.tFAILED--expected 641 tests, saw 81

Compiler messages(gcc):
sv.c: In function âPerl_sv_len_utf8â:
sv.c:5404: warning: comparison is always false due to limited range of data type
sv.c: In function âS_sv_pos_u2b_cachedâ:
sv.c:5559: warning: comparison is always false due to limited range of data type
sv.c:5564: warning: comparison is always false due to limited range of data type
sv.c: In function âS_utf8_mg_pos_cache_updateâ:
sv.c:5684: warning: comparison is always false due to limited range of data type
sv.c: In function âPerl_sv_pos_b2uâ:
sv.c:5906: warning: comparison is always false due to limited range of data type
sv.c:5909: warning: comparison is always false due to limited range of data type
proto.h:3646: warning: âS_emulate_eaccessâ declared âstaticâ but never defined
regcomp.c: In function âPerl_regpropâ:
regcomp.c:8828: warning: format â%LXâ expects type âlong long unsigned intâ, 
but argument 3 has type âU32â
regcomp.c:8828: warning: format â%LXâ expects type âlong long unsigned intâ, 
but argument 4 has type âU32â

-- 
Report by Test::Smoke v1.19_87 build 1048 running on perl 5.8.8
(Reporter v0.027 / Smoker v0.032)


<Prev in Thread] Current Thread [Next in Thread>
  • Smoke [5.9.5] 31466 FAIL(F) linux 2.6.15-27-powerpc [debian] (ppc/1 cpu), Abe Timmerman <=