cactus-dev@jakarta.apache.org
[Top] [All Lists]

[GUMP@vmgump]: Project jakarta-cactus-sample-jetty-13 (in module jakarta

Subject: : Project jakarta-cactus-sample-jetty-13 (in module jakarta-cactus) failed
From: Vincent Massol
Date: Thu, 10 Nov 2005 05:11:44 PST
To whom it may engage...
        
This is an automated request, but not an unsolicited one. For 
more information please visit http://gump.apache.org/nagged.html, 
and/or contact the folk at general@xxxxxxxxxxxxxxxx

Project jakarta-cactus-sample-jetty-13 has an issue affecting its community 
integration.
This issue affects 2 projects,
 and has been outstanding for 9 runs.
The current state of this project is 'Failed', with reason 'Build Failed'.
For reference only, the following projects are affected by this:
    - jakarta-cactus-release-13 :  Unit test framework for server-side java code
    - jakarta-cactus-sample-jetty-13 :  Cactus Jetty Sample (J2EE 1.3)


Full details are available at:
    
http://vmgump.apache.org/gump/public/jakarta-cactus/jakarta-cactus-sample-jetty-13/index.html

That said, some information snippets are provided here.

The following annotations (debug/informational/warning/error messages) were 
provided:
 -DEBUG- Sole output [bin] identifier set to project name
 -DEBUG- Dependency on jakarta-tomcat-4.0 exists, no need to add for property 
jasper-runtime.jar.
 -DEBUG- Dependency on aspectj exists, no need to add for property 
aspectjrt.jar.
 -DEBUG- Dependency on jakarta-cactus-integration-ant-13 exists, no need to add 
for property cactus.ant.jar.
 -INFO- Made directory 
[/usr/local/gump/public/workspace/jakarta-cactus/samples/jetty/target-13/classes/java]
 -INFO- Made directory 
[/usr/local/gump/public/workspace/jakarta-cactus/samples/jetty/target-13/classes/cactus]
 -INFO- Failed with reason build failed
 -INFO- Failed to extract fallback artifacts from Gump Repository



The following work was performed:
http://vmgump.apache.org/gump/public/jakarta-cactus/jakarta-cactus-sample-jetty-13/gump_work/build_jakarta-cactus_jakarta-cactus-sample-jetty-13.html
Work Name: build_jakarta-cactus_jakarta-cactus-sample-jetty-13 (Type: Build)
Work ended in a state of : Failed
Elapsed: 7 secs
Command Line: java -Djava.awt.headless=true 
-Xbootclasspath/p:/usr/local/gump/public/workspace/xml-commons/java/external/build/xml-apis.jar:/usr/local/gump/public/workspace/xml-xerces2/java/build/xercesImpl.jar
 org.apache.tools.ant.Main -Dgump.merge=/x1/gump/public/gump/work/merge.xml 
-Dbuild.sysclasspath=only 
-Djunit.jar=/usr/local/gump/public/workspace/dist/junit/junit.jar 
-Dhttpunit.jar=/usr/local/gump/public/workspace/httpunit/lib/httpunit.jar 
-Dcactus.ant.jar=/usr/local/gump/public/workspace/jakarta-cactus/integration/ant/dist-13/lib/cactus-ant-10112005.jar
 
-Dcommons.logging.jar=/usr/local/gump/public/workspace/jakarta-commons/logging/dist/commons-logging-10112005.jar
 -Dnekohtml.jar=/usr/local/gump/packages/nekohtml-0.9.5/nekohtml.jar 
-Dhtmlunit.jar=/usr/local/gump/public/workspace/htmlunit/target/htmlunit-10112005.jar
 
-Dcommons.httpclient.jar=/usr/local/gump/public/workspace/commons-httpclient-20-branch/dist/commons-httpclient-2.0-10112005.jar
 -Dcactus.port=8082 -Djetty
 .jar=/usr/local/gump/public/workspace/jetty/lib/org.mortbay.jetty.jar 
-Djasper-runtime.jar=/usr/local/gump/public/workspace/jakarta-tomcat-4.0/dist/common/lib/jasper-runtime.jar
 
-Dservlet.jar=/usr/local/gump/public/workspace/jakarta-servletapi-4/lib/servlet.jar
 -Dproject.version=10112005 
-Daspectjrt.jar=/usr/local/gump/packages/aspectj-1.2.1rc1/lib/aspectjrt.jar 
-Djasper-compiler.jar=/usr/local/gump/public/workspace/jakarta-tomcat-4.0/dist/common/lib/jasper-compiler.jar
 
-Dcactus.jar=/usr/local/gump/public/workspace/jakarta-cactus/framework/dist-13/lib/cactus-10112005.jar
 -f samples/jetty/build.xml dist 
[Working Directory: /usr/local/gump/public/workspace/jakarta-cactus]
CLASSPATH: 
/opt/jdk1.4/lib/tools.jar:/usr/local/gump/public/workspace/jakarta-cactus/samples/jetty/target-13/classes/java:/usr/local/gump/public/workspace/jakarta-cactus/samples/jetty/target-13/classes/cactus:/usr/local/gump/public/workspace/ant/dist/lib/ant-jmf.jar:/usr/local/gump/public/workspace/ant/dist/lib/ant-swing.jar:/usr/local/gump/public/workspace/ant/dist/lib/ant-apache-resolver.jar:/usr/local/gump/public/workspace/ant/dist/lib/ant-trax.jar:/usr/local/gump/public/workspace/ant/dist/lib/ant-junit.jar:/usr/local/gump/public/workspace/ant/dist/lib/ant-launcher.jar:/usr/local/gump/public/workspace/ant/dist/lib/ant-nodeps.jar:/usr/local/gump/public/workspace/ant/dist/lib/ant.jar:/usr/local/gump/public/workspace/dist/junit/junit.jar:/usr/local/gump/public/workspace/xml-commons/java/build/resolver.jar:/usr/local/gump/packages/aspectj-1.2.1rc1/lib/aspectjrt.jar:/usr/local/gump/packages/aspectj-1.2.1rc1/lib/aspectjtools.jar:/usr/local/gump/packages/aspectj-1.2.1rc1/lib/aspe
 
ctjweaver.jar:/usr/local/gump/public/workspace/jakarta-cactus/integration/ant/dist-13/lib/cactus-ant-10112005.jar:/usr/local/gump/packages/cargo/cargo-0.6.jar:/usr/local/gump/public/workspace/jetty/lib/org.mortbay.jetty.jar:/usr/local/gump/public/workspace/jakarta-tomcat-4.0/dist/common/lib/jasper-compiler.jar:/usr/local/gump/public/workspace/jakarta-servletapi-4/lib/servlet.jar:/usr/local/gump/public/workspace/jakarta-commons/logging/dist/commons-logging-10112005.jar:/usr/local/gump/public/workspace/commons-httpclient-20-branch/dist/commons-httpclient-2.0-10112005.jar:/usr/local/gump/public/workspace/httpunit/lib/httpunit.jar:/usr/local/gump/packages/nekohtml-0.9.5/nekohtml.jar:/usr/local/gump/public/workspace/jakarta-cactus/framework/dist-13/lib/cactus-10112005.jar:/usr/local/gump/public/workspace/htmlunit/target/htmlunit-10112005.jar
---------------------------------------------
    [mkdir] Created dir: 
/x1/gump/public/workspace/jakarta-cactus/samples/jetty/target-13/sample/src/test-cactus
     [copy] Copying 5 files to 
/x1/gump/public/workspace/jakarta-cactus/samples/jetty/target-13/sample/src/test-cactus
     [copy] Copying 1 file to 
/x1/gump/public/workspace/jakarta-cactus/samples/jetty/target-13/sample/src/test-cactus
    [mkdir] Created dir: 
/x1/gump/public/workspace/jakarta-cactus/samples/jetty/target-13/sample/src/webapp
     [copy] Copying 3 files to 
/x1/gump/public/workspace/jakarta-cactus/samples/jetty/target-13/sample/src/webapp
    [mkdir] Created dir: 
/x1/gump/public/workspace/jakarta-cactus/samples/jetty/target-13/sample/lib
     [copy] Copying 3 files to 
/x1/gump/public/workspace/jakarta-cactus/samples/jetty/target-13/sample/lib
     [copy] Copying 2 files to 
/x1/gump/public/workspace/jakarta-cactus/samples/jetty/target-13/sample

test.prepare:

test:

init:

compile.java:
    [javac] Compiling 7 source files to 
/x1/gump/public/workspace/jakarta-cactus/samples/jetty/target-13/classes/java

compile.cactus:
    [javac] Compiling 6 source files to 
/x1/gump/public/workspace/jakarta-cactus/samples/jetty/target-13/classes/cactus
    [javac] Note: 
/x1/gump/public/workspace/jakarta-cactus/samples/jetty/target-13/sample/src/test-cactus/org/apache/cactus/sample/servlet/TestSampleServlet.java
 uses or overrides a deprecated API.
    [javac] Note: Recompile with -deprecation for details.

compile:

test:
    [mkdir] Created dir: 
/x1/gump/public/workspace/jakarta-cactus/samples/jetty/target-13/test-reports
    [junit] Testsuite: org.apache.cactus.sample.jetty.TestJettyAll
    [junit] Tests run: 0, Failures: 0, Errors: 1, Time elapsed: 0.434 sec

    [junit] Testcase: Cactus unit tests executing in Jetty:     Caused an ERROR
    [junit] 
org.mortbay.jetty.servlet.FilterHolder.addAppliesTo(java.lang.String)
    [junit] java.lang.NoSuchMethodException: 
org.mortbay.jetty.servlet.FilterHolder.addAppliesTo(java.lang.String)
    [junit]     at java.lang.Class.getMethod(Class.java:986)
    [junit]     at 
org.apache.cactus.extension.jetty.JettyTestSetup.addFilterRedirector(JettyTestSetup.java:488)
    [junit]     at 
org.apache.cactus.extension.jetty.JettyTestSetup.setUp(JettyTestSetup.java:221)
    [junit]     at 
org.apache.cactus.extension.jetty.JettyTestSetup$1.protect(JettyTestSetup.java:165)
    [junit]     at 
org.apache.cactus.extension.jetty.JettyTestSetup.run_aroundBody0(JettyTestSetup.java:174)
    [junit]     at 
org.apache.cactus.extension.jetty.JettyTestSetup.run_aroundBody1$advice(JettyTestSetup.java:224)
    [junit]     at 
org.apache.cactus.extension.jetty.JettyTestSetup.run(JettyTestSetup.java)


    [junit] Test org.apache.cactus.sample.jetty.TestJettyAll FAILED
[junitreport] Transform time: 1867ms

BUILD FAILED
/x1/gump/public/workspace/jakarta-cactus/samples/jetty/build.xml:273: The 
following error occurred while executing this line:
/x1/gump/public/workspace/jakarta-cactus/samples/jetty/target-13/sample/build.xml:256:
 At least one test failed!

Total time: 7 seconds
---------------------------------------------

To subscribe to this information via syndicated feeds:
- RSS: 
http://vmgump.apache.org/gump/public/jakarta-cactus/jakarta-cactus-sample-jetty-13/rss.xml
- Atom: 
http://vmgump.apache.org/gump/public/jakarta-cactus/jakarta-cactus-sample-jetty-13/atom.xml

============================== Gump Tracking Only ===
Produced by Gump version 2.2.
Gump Run 31000010112005, vmgump.apache.org:vmgump-public:31000010112005
Gump E-mail Identifier (unique within run) #44.

--
Apache Gump
http://gump.apache.org/ [Instance: vmgump]

---------------------------------------------------------------------
To unsubscribe, e-mail: cactus-dev-unsubscribe@xxxxxxxxxxxxxxxxxx
For additional commands, e-mail: cactus-dev-help@xxxxxxxxxxxxxxxxxx

<Prev in Thread] Current Thread [Next in Thread>