cactus-dev@jakarta.apache.org
[Top] [All Lists]

[GUMP@brutus]: Project jakarta-cactus-sample-servlet-12 (in module jakar

Subject: : Project jakarta-cactus-sample-servlet-12 (in module jakarta-cactus) failed
From: Vincent Massol
Date: Sun, 21 Nov 2004 17:18:37 PST
To whom it may engage...
        
This is an automated request, but not an unsolicited one. For 
more information please visit http://gump.apache.org/nagged.html, 
and/or contact the folk at general@xxxxxxxxxxxxxxxx

Project jakarta-cactus-sample-servlet-12 has an issue affecting its community 
integration.
This issue affects 1 projects.
The current state of this project is 'Failed', with reason 'Build Failed'.
For reference only, the following projects are affected by this:
    - jakarta-cactus-sample-servlet-12 :  Cactus Servlet Sample (J2EE 1.2)


Full details are available at:
    
http://brutus.apache.org/gump/public/jakarta-cactus/jakarta-cactus-sample-servlet-12/index.html

That said, some information snippets are provided here.

The following annotations (debug/informational/warning/error messages) were 
provided:
 -DEBUG- Sole output [bin] identifier set to project name
 -DEBUG- Dependency on commons-httpclient-2.0-branch exists, no need to add for 
property commons.httpclient.jar.
 -DEBUG- Dependency on aspectj exists, no need to add for property 
aspectjrt.jar.
 -DEBUG- Dependency on jakarta-cactus-integration-ant-12 exists, no need to add 
for property cactus.ant.jar.
 -DEBUG- Dependency on jakarta-tomcat exists, no need to add for property 
cactus.home.tomcat3x.
 -INFO- Made directory 
[/usr/local/gump/public/workspace/jakarta-cactus/samples/servlet/target-12/test/classes/java]
 -INFO- Made directory 
[/usr/local/gump/public/workspace/jakarta-cactus/samples/servlet/target-12/test/classes/cactus]
 -INFO- Failed with reason build failed
 -INFO- Failed to extract fallback artifacts from Gump Repository



The following work was performed:
http://brutus.apache.org/gump/public/jakarta-cactus/jakarta-cactus-sample-servlet-12/gump_work/build_jakarta-cactus_jakarta-cactus-sample-servlet-12.html
Work Name: build_jakarta-cactus_jakarta-cactus-sample-servlet-12 (Type: Build)
Work ended in a state of : Failed
Elapsed: 1 min 3 secs
Command Line: java -Djava.awt.headless=true 
-Xbootclasspath/p:/usr/local/gump/public/workspace/xml-xerces2/java/build/xercesImpl.jar:/usr/local/gump/public/workspace/xml-xerces2/java/build/xml-apis.jar
 org.apache.tools.ant.Main 
-Dgump.merge=/home/gump/workspaces2/public/gump/work/merge.xml 
-Dbuild.sysclasspath=only 
-Dlog4j.jar=/usr/local/gump/public/workspace/logging-log4j/log4j-21112004.jar 
-Djunit.jar=/usr/local/gump/public/workspace/dist/junit/junit.jar 
-Dhttpunit.jar=/usr/local/gump/public/workspace/httpunit/lib/httpunit.jar 
-Dcommons.logging.jar=/usr/local/gump/public/workspace/jakarta-commons/logging/dist/commons-logging.jar
 -Dnekohtml.jar=/usr/local/gump/packages/nekohtml-0.9.3/nekohtml.jar 
-Dcommons.httpclient.jar=/usr/local/gump/public/workspace/commons-httpclient-20-branch/dist/commons-httpclient-2.0-21112004.jar
 -Dcactus.port=8082 
-Dcactus.home.tomcat3x=/usr/local/gump/public/workspace/jakarta-tomcat/build/tomcat
 
-Dcactus.ant.jar=/usr/local/gump/public/workspace/jakarta-cactus/integration/ant/dist-12/lib/cactus-ant-21112004.jar
 
-Dservlet.jar=/usr/local/gump/public/workspace/jakarta-servletapi/dist/lib/servlet.jar
 -Dproject.version=21112004 
-Daspectjrt.jar=/usr/local/gump/packages/aspectj-1.2.1rc1/lib/aspectjrt.jar 
-Dcactus.jar=/usr/local/gump/public/workspace/jakarta-cactus/framework/dist-12/lib/cactus-21112004.jar
 -f samples/servlet/build.xml dist 
[Working Directory: /usr/local/gump/public/workspace/jakarta-cactus]
CLASSPATH: 
/opt/jdk1.4/lib/tools.jar:/usr/local/gump/public/workspace/jakarta-cactus/samples/servlet/target-12/test/classes/java:/usr/local/gump/public/workspace/jakarta-cactus/samples/servlet/target-12/test/classes/cactus:/usr/local/gump/public/workspace/ant/dist/lib/ant-stylebook.jar:/usr/local/gump/public/workspace/ant/dist/lib/ant-jmf.jar:/usr/local/gump/public/workspace/ant/dist/lib/ant-swing.jar:/usr/local/gump/public/workspace/ant/dist/lib/ant-trax.jar:/usr/local/gump/public/workspace/ant/dist/lib/ant-junit.jar:/usr/local/gump/public/workspace/ant/dist/lib/ant-launcher.jar:/usr/local/gump/public/workspace/ant/dist/lib/ant-nodeps.jar:/usr/local/gump/public/workspace/ant/dist/lib/ant.jar:/usr/local/gump/public/workspace/jakarta-tomcat/build/tomcat/lib/common/tomcat-util.jar:/usr/local/gump/public/workspace/jakarta-tomcat/build/tomcat/lib/common/tomcat_core.jar:/usr/local/gump/public/workspace/jakarta-tomcat/build/tomcat/lib/container/tomcat_modules.jar:/usr/local/gump/public/workspace/jakarta-tomcat/build/tomcat/lib/container/facade22.jar:/usr/local/gump/public/workspace/jakarta-tomcat/build/tomcat/lib/common/core_util.jar:/usr/local/gump/public/workspace/jakarta-tomcat/build/tomcat/lib/container/jasper.jar:/usr/local/gump/public/workspace/jakarta-tomcat/build/tomcat/lib/container/container_util.jar:/usr/local/gump/public/workspace/jakarta-tomcat/build/tomcat/lib/tomcat.jar:/usr/local/gump/packages/aspectj-1.2.1rc1/lib/aspectjrt.jar:/usr/local/gump/packages/aspectj-1.2.1rc1/lib/aspectjtools.jar:/usr/local/gump/packages/aspectj-1.2.1rc1/lib/aspectjweaver.jar:/usr/local/gump/public/workspace/jakarta-cactus/integration/ant/dist-12/lib/cactus-ant-21112004.jar:/usr/local/gump/public/workspace/checkstyle/target/dist/checkstyle-21112004/checkstyle-21112004.jar:/usr/local/gump/packages/antlr-2.7.3/antlr.jar:/usr/local/gump/public/workspace/jakarta-regexp/build/jakarta-regexp-21112004.jar:/usr/local/gump/public/workspace/ant/bootstrap/lib/ant-launcher.jar:/usr/local/gump/public/workspace/ant/bootstrap/lib/ant.jar:/usr/local/gump/public/workspace/jakarta-bcel/bin/bcel.jar:/usr/local/gump/public/workspace/jakarta-commons/beanutils/dist/commons-beanutils-core.jar:/usr/local/gump/public/workspace/jakarta-commons/cli/target/commons-cli-21112004.jar:/usr/local/gump/public/workspace/jakarta-commons/collections/build/commons-collections-21112004.jar:/usr/local/gump/public/workspace/jakarta-commons/logging/dist/commons-logging.jar:/usr/local/gump/public/workspace/jakarta-commons/logging/dist/commons-logging-api.jar:/usr/local/gump/public/workspace/jdom/build/jdom.jar:/usr/local/gump/public/workspace/jakarta-velocity/bin/velocity-21112004.jar:/usr/local/gump/public/workspace/avalon-trunk/runtime/logkit/target/deliverables/jars/avalon-logkit-21112004.jar:/usr/local/gump/public/workspace/avalon-tools/tools/magic/target/deliverables/jars/avalon-tools-magic-21112004.jar:/usr/local/gump/public/workspace/dist/junit/junit.jar:/usr/local/gump/public/workspace/commons-httpclient-20-branch/dist/commons-httpclient-2.0-21112004.jar:/usr/local/gump/public/workspace/jakarta-commons/codec/dist/commons-codec-21112004.jar:/usr/local/gump/public/workspace/jakarta-servletapi/dist/lib/servlet.jar:/usr/local/gump/public/workspace/logging-log4j/log4j-21112004.jar:/usr/local/gump/public/workspace/httpunit/lib/httpunit.jar:/usr/local/gump/packages/nekohtml-0.9.3/nekohtml.jar:/usr/local/gump/public/workspace/jakarta-cactus/framework/dist-12/lib/cactus-21112004.jar
---------------------------------------------

   [cactus] Testsuite: org.apache.cactus.sample.servlet.unit.TestServletContext
   [cactus] Tests run: 2, Failures: 0, Errors: 0, Time elapsed: 0.604 sec

   [cactus] Testsuite: 
org.apache.cactus.sample.servlet.unit.TestServletRedirectorOverride
   [cactus] Tests run: 3, Failures: 0, Errors: 0, Time elapsed: 0.613 sec

   [cactus] Testsuite: org.apache.cactus.sample.servlet.unit.TestSetURL
   [cactus] Tests run: 7, Failures: 0, Errors: 0, Time elapsed: 0.719 sec

   [cactus] Testsuite: org.apache.cactus.sample.servlet.unit.TestSetUpTearDown
   [cactus] Tests run: 2, Failures: 0, Errors: 0, Time elapsed: 0.606 sec

   [cactus] Testsuite: 
org.apache.cactus.sample.servlet.unit.TestTearDownException
   [cactus] Tests run: 1, Failures: 1, Errors: 0, Time elapsed: 0.583 sec

   [cactus] Testcase: 
testTearDown(org.apache.cactus.sample.servlet.unit.TestTearDownException):      
  FAILED
   [cactus] expected:<[testTearDown() worked]> but was:<[provoked error]>
   [cactus] junit.framework.ComparisonFailure: expected:<[testTearDown() 
worked]> but was:<[provoked error]>
   [cactus]     at 
org.apache.cactus.sample.servlet.unit.TestTearDownException.runBare(Unknown 
Source)


   [cactus] Test org.apache.cactus.sample.servlet.unit.TestTearDownException 
FAILED
   [cactus] Testsuite: org.apache.cactus.sample.servlet.TestSampleBodyTag
   [cactus] Tests run: 1, Failures: 0, Errors: 0, Time elapsed: 0.572 sec

   [cactus] Testsuite: org.apache.cactus.sample.servlet.TestSampleServlet
   [cactus] Tests run: 13, Failures: 0, Errors: 0, Time elapsed: 0.859 sec

   [cactus] Testsuite: org.apache.cactus.sample.servlet.TestSampleServletConfig
   [cactus] Tests run: 1, Failures: 0, Errors: 0, Time elapsed: 0.571 sec

   [cactus] Testsuite: org.apache.cactus.sample.servlet.TestSampleTag
   [cactus] Tests run: 4, Failures: 0, Errors: 0, Time elapsed: 0.649 sec

   [cactus] Stopping Tomcat.
   [cactus] Stopping tomcat on :8777 null
[junitreport] Transform time: 553ms
[junitreport] Transform time: 192ms
[junitreport] Transform time: 191ms
[junitreport] Transform time: 10229ms
[junitreport] Transform time: 126ms
[junitreport] Transform time: 120ms
[junitreport] Transform time: 126ms

BUILD FAILED
/home/gump/workspaces2/public/workspace/jakarta-cactus/samples/servlet/build.xml:330:
 The following error occurred while executing this line:
/home/gump/workspaces2/public/workspace/jakarta-cactus/samples/servlet/target-12/sample/build.xml:454:
 At least one test failed!

Total time: 1 minute 3 seconds
---------------------------------------------

To subscribe to this information via syndicated feeds:
- RSS: 
http://brutus.apache.org/gump/public/jakarta-cactus/jakarta-cactus-sample-servlet-12/rss.xml
- Atom: 
http://brutus.apache.org/gump/public/jakarta-cactus/jakarta-cactus-sample-servlet-12/atom.xml

============================== Gump Tracking Only ===
Produced by Gump version 2.2.
Gump Run 19001521112004, brutus:brutus-public:19001521112004
Gump E-mail Identifier (unique within run) #3.

--
Apache Gump
http://gump.apache.org/ [Instance: brutus]

---------------------------------------------------------------------
To unsubscribe, e-mail: cactus-dev-unsubscribe@xxxxxxxxxxxxxxxxxx
For additional commands, e-mail: cactus-dev-help@xxxxxxxxxxxxxxxxxx

<Prev in Thread] Current Thread [Next in Thread>